program: Gaussian 09
title: 000249256
version: EM64L-G09RevD.01
frameworkgroup: C1[X(C23H19NO3)]
method: RPBEPBE
basis: SDD
operation: Freq
keyword: #p
keyword: freq=noraman
keyword: PBEPBE/SDD
title: #p freq=noraman PBEPBE/SDD
converged: YES YES NO NO
title: Mulliken charges:
elementType: O O O N C C C C C C C C C C C C C C C C C C C C C C C H H H H H H H H H H H H H H H H H H H
charge: -0.412844 -0.236512 -0.229670 -0.315741 -0.112481 0.345682 0.053930 0.433447 0.043465 0.401479 -0.379794 -0.361873 -0.361770 -0.392402 -0.215731 -0.382126 -0.306534 -0.221307 -0.365010 -0.403611 -0.228252 -0.219992 0.316875 -0.238114 0.117551 -0.482338 -0.687673 0.263363 0.272900 0.362185 0.247659 0.277878 0.235300 0.306605 0.298563 0.237829 0.243444 0.275862 0.230700 0.228755 0.231980 0.231116 0.229713 0.230523 0.207442 0.229527
chargesum: 0.00000
title: Mulliken charges with hydrogens summed into heavy atoms:
elementType: O O O N C C C C C C C C C C C C C C C C C C C C C C C
charge: -0.050659 -0.236512 -0.229670 -0.315741 -0.112481 0.345682 0.053930 0.433447 0.043465 0.401479 -0.116431 -0.088974 -0.114111 -0.114524 0.019570 -0.075521 -0.007971 0.016521 -0.121566 -0.127749 0.002448 0.008764 0.316875 -0.006133 0.117551 -0.021509 -0.020181
polarizability: 3.94268381e+02 -2.24445707e+01 2.69254177e+02 -7.67617007e+00 -2.96676852e+01 1.78062820e+02
1716.lowfreq: 0.0005 0.0007 0.0010 2.0899 5.0357 6.1840 21.4677 38.0821 46.4976
frequency: 21.4132 38.0727 46.4536 49.4961 54.7872 64.1929 80.6623 89.2228 105.1828 136.1986 151.2082 181.5380 193.2651 196.3737 223.3628 241.3833 264.9342 272.6605 291.0712 319.2127 327.0054 348.2983 368.6095 377.3165 400.5334 404.1793 407.6272 425.2827 468.9004 475.8809 489.2684 521.6508 536.2071 570.5548 584.2373 612.0940 616.1720 631.8349 645.4893 675.2684 679.6136 689.0472 707.3167 735.0187 737.7868 758.5231 773.7177 790.8604 803.1521 834.0570 839.3496 847.1696 860.8471 863.5887 891.1837 904.1025 937.8026 948.7974 967.0984 984.8495 987.2673 988.1716 990.2925 998.9882 1001.4076 1002.9010 1006.9119 1013.1392 1018.6468 1021.8630 1032.2182 1068.6983 1085.5282 1090.4085 1095.2453 1104.3508 1142.3519 1157.8628 1170.3147 1174.7925 1187.3964 1190.8605 1200.3841 1236.8849 1241.4762 1246.5381 1280.9524 1300.7510 1312.8117 1320.0176 1331.6691 1339.4764 1375.6986 1383.4331 1396.2780 1407.9490 1429.5194 1437.1654 1439.3306 1452.7832 1462.1078 1468.3378 1477.7343 1481.5610 1506.8292 1553.6550 1590.7193 1594.4682 1611.8334 1613.6375 1616.9721 1621.8750 1634.0539 2968.5675 2996.5982 3015.4091 3092.0435 3101.4264 3128.3922 3136.1357 3136.8408 3144.8219 3148.5255 3150.0985 3152.9814 3161.3383 3162.5801 3172.6177 3173.5994 3195.9068 3199.5649 3555.7620
redmass: 4.7877 6.3426 4.0510 4.1843 5.3861 4.3119 4.9888 2.0483 3.8999 5.3016 4.5966 1.8173 2.2417 6.1676 4.6789 5.3303 4.6665 4.0332 5.0429 4.2332 2.5246 3.1609 2.7637 4.9380 5.2129 2.8682 2.9666 3.5086 4.6773 5.4279 3.8611 3.8114 7.4964 2.3690 4.1015 6.0549 6.3954 7.1299 5.9483 5.7202 4.7894 5.6902 1.8585 3.2036 4.2821 2.0653 2.0858 2.0953 1.4901 6.0005 5.4655 1.2777 1.3309 1.4894 1.6012 2.8182 1.5073 4.4499 1.4199 2.0929 1.6992 1.7358 4.9682 1.4125 1.3395 1.4720 2.8200 2.2074 1.9801 2.6867 2.5756 1.6573 1.7410 3.1546 2.7940 1.9724 1.4231 1.9149 1.1453 1.0559 2.1430 1.1475 1.3290 2.5361 2.5775 1.1887 1.5806 2.7505 1.5968 1.5715 2.0199 1.7983 6.5424 9.0282 1.2115 7.9641 3.3637 2.2130 1.1129 2.4919 2.6364 1.0392 1.0528 2.2878 2.4721 7.2241 7.7620 6.3819 6.2027 7.5463 6.9525 6.8890 11.3457 1.0601 1.0365 1.0981 1.1001 1.0998 1.0850 1.0884 1.0862 1.0902 1.0937 1.0902 1.0905 1.0955 1.0970 1.1003 1.0985 1.0937 1.0938 1.0659
irintensity: 1.5685 1.5442 0.2336 0.4015 2.2509 0.1591 1.4731 1.9515 0.7180 0.8939 0.9893 0.4441 0.6319 0.7249 1.2247 0.8209 2.0736 3.3389 11.0660 14.1623 15.2032 66.8219 40.6955 17.1607 0.6832 0.5394 0.5502 6.0065 0.8606 11.6414 16.2374 8.4137 3.5238 17.7148 0.6127 3.2081 0.3926 0.3972 7.1588 8.3829 19.8937 5.6965 46.8838 1.9031 1.9884 38.3456 64.0649 33.7257 40.0144 4.0347 19.8982 2.2448 8.9063 23.5618 16.0942 57.9906 15.5200 75.9118 3.2669 18.5238 20.9251 25.8207 2.1041 1.8651 0.2440 7.9656 4.5330 16.9979 31.5391 29.9579 5.1503 1.4957 3.2296 3.7807 7.4952 40.6512 27.1873 50.7941 4.0547 0.1439 35.7900 2.5317 164.9932 224.9846 45.4352 1.4071 0.9037 243.6587 73.2575 114.2172 185.6132 55.5954 37.6763 1.2947 30.5805 3.3235 53.2708 15.3442 21.8364 21.4300 2.0476 11.4210 18.3823 10.3679 57.2593 89.7021 179.1493 2.1185 2.8292 2.7046 52.6167 45.0218 230.8865 39.2593 38.4399 10.2741 28.9425 31.4377 0.9118 4.1491 1.3059 13.6277 24.6011 6.7973 0.4590 8.1505 18.2073 26.2486 10.9205 7.3199 0.6374 14.5536
temp: 298.150 k
press: 1.00000 atm
elementType: 8 8 8 7 6 6 6 6 6 6 6 6 6 6 6 6 6 6 6 6 6 6 6 6 6 6 6 1 1 1 1 1 1 1 1 1 1 1 1 1 1 1 1 1 1 1
symmnumber: 1
zpe: 939970.0 jmol-1
zpe.correction: 0.358016 hartree
zpe.thermalcorrener: 0.381148 hartree
zpe.thermalcorrenthalpy: 0.382092 hartree
zpe.thermalcorrgfe: 0.304438 hartree
zpe.sumelectzpe: -1166.424341 hartree
zpe.sumelectthermal: -1166.401209 hartree
zpe.sumelectthermalent: -1166.400265 hartree
zpe.sumelectthermalfe: -1166.477919 hartree
dipole: 5.7020 -0.0891 0.5150
dipole: 5.7259
quadrupole: -148.1541 -153.5030 -152.0457
quadrupole: 10.8213 -12.9994 4.0133
quadrupole: 3.0802 -2.2688 -0.8114 10.8213 -12.9994 4.0133
hfenergy: -1166.7823567 hartree
pointgroup: C01 [X(C23H19N1O3)]
dipole: 2.2492083 -0.0190462 -0.1246409 debye
polarizability: 394.3377899|22.2957841|262.4004181|12.5165889|-36.7774505|184.8471702 unknown
InChI: InChI=1S/C23H19NO3/c1-2-21(25)16-12-14-18(15-13-16)24-22(26)19-10-6-7-11-20(19)23(24,27)17-8-4-3-5-9-17/h3-15,27H,2H2,1H3
charge 0 multiplicity 1
46 atoms
O  1.274823 -0.226393 2.168953
O  0.82144 2.927617 -1.154622
O  -5.633894 -0.871776 0.749537
N  0.593115 0.861157 0.062696
C  1.523373 -0.128439 0.727098
C  2.895387 0.493192 0.455269
C  2.75147 1.691946 -0.265435
C  1.409687 -1.54686 0.152944
C  1.309315 1.946832 -0.529835
C  -0.826777 0.691306 0.057191
C  4.162727 0.026396 0.840311
C  3.862256 2.473152 -0.63488
C  1.172706 -1.73382 -1.229959
C  1.62838 -2.67078 0.984829
C  5.290618 0.805136 0.478966
C  -1.664754 1.547506 -0.714551
C  -1.427898 -0.350363 0.823722
C  5.143922 2.014228 -0.251956
C  -3.057826 1.353247 -0.718217
C  -2.818045 -0.529628 0.805059
C  1.144227 -3.034917 -1.774836
C  1.596929 -3.972823 0.436601
C  -3.664134 0.313648 0.035283
C  1.357095 -4.159541 -0.943793
C  -5.144734 0.072553 0.058897
C  -6.053174 0.992599 -0.767722
C  -7.543476 0.627979 -0.661409
H  4.277828 -0.911413 1.392884
H  3.721821 3.400745 -1.198649
H  1.479187 0.650232 2.585278
H  0.995681 -0.867932 -1.877659
H  1.798389 -2.517632 2.054306
H  6.293125 0.467309 0.763514
H  -1.220205 2.357224 -1.294022
H  -0.810714 -1.00199 1.443041
H  6.034129 2.592695 -0.521153
H  -3.67144 2.028165 -1.324048
H  -3.28421 -1.327251 1.392924
H  0.950501 -3.171699 -2.844278
H  1.756108 -4.839385 1.087907
H  1.330743 -5.169641 -1.367258
H  -5.884942 2.038333 -0.437181
H  -5.718978 0.957211 -1.824965
H  -7.886878 0.677821 0.385878
H  -8.156546 1.318075 -1.268621
H  -7.722052 -0.403526 -1.01004
