program: Gaussian 09
title: 000249237
version: EM64L-G09RevD.01
frameworkgroup: C1[X(C18H20O2)]
method: RPBEPBE
basis: SDD
operation: Freq
keyword: #pfreq=noraman
keyword: PBEPBE/SDD
title: #p freq=noraman PBEPBE/SDD
converged: YES YES NO NO
title: Mulliken charges:
elementType: O O C C C C C C C C C C C C C C C C C C H H H H H H H H H H H H H H H H H H H H
charge: -0.212272 -0.212271 -0.217191 -0.217174 0.300489 0.300512 -0.574005 -0.574007 0.156523 0.156524 -0.327119 -0.327133 -0.580112 -0.580125 0.098126 0.098107 -0.333406 -0.333412 -0.678699 -0.678710 0.262742 0.262736 0.267180 0.238922 0.267172 0.238927 0.218748 0.218773 0.219824 0.232510 0.219826 0.232524 0.249977 0.249980 0.224775 0.230666 0.222317 0.224776 0.230664 0.222318
chargesum: 0.00000
title: Mulliken charges with hydrogens summed into heavy atoms:
elementType: O O C C C C C C C C C C C C C C C C C C
charge: -0.212272 -0.212271 0.045551 0.045562 0.300489 0.300512 -0.067903 -0.067909 0.156523 0.156524 -0.108371 -0.108360 -0.127779 -0.127775 0.098126 0.098107 -0.083429 -0.083432 -0.000940 -0.000953
polarizability: 3.28750517e+02 8.07216116e-03 2.66955945e+02 -1.18790904e+01 -3.22476433e-03 1.19781560e+02
1716.lowfreq: -12.7809 0.0004 0.0008 0.0008 6.1989 11.1720 32.0028 46.9328 53.1220
frequency: 31.9811 46.8015 52.8758 59.9852 69.6476 91.8680 112.7935 130.3511 155.0425 205.7902 206.9621 219.5659 241.1933 293.5171 304.7648 316.4331 330.5940 352.2453 379.4205 386.0832 426.6598 450.6895 460.5450 492.7445 499.4819 525.9396 543.2853 560.9703 590.3510 613.9529 646.7955 657.9653 714.4226 734.8559 743.7619 751.4463 785.1344 810.5258 818.9386 828.4100 859.4732 883.2759 887.6988 933.6645 960.7663 978.6074 983.2371 985.2651 1002.6922 1030.8842 1039.5066 1055.8544 1056.7866 1080.7967 1098.3794 1101.0792 1134.2537 1136.0969 1140.0417 1178.7719 1184.4540 1206.2943 1236.1478 1252.1580 1260.2057 1263.8975 1270.4293 1277.8023 1287.2079 1296.3132 1300.4673 1306.5714 1309.7734 1319.3033 1334.7117 1355.7085 1390.7449 1391.6897 1395.3287 1411.8055 1437.0606 1440.7296 1471.7162 1472.7955 1480.4435 1481.3237 1489.8816 1496.7353 1539.8563 1542.7929 1562.2145 1579.1222 1588.1842 1591.6766 2895.2136 2915.0273 2956.0867 2956.4954 2981.2130 2981.3918 3027.4040 3030.4596 3061.7241 3063.3577 3068.2584 3078.9672 3081.4957 3081.8155 3087.5183 3089.6647 3129.9587 3130.1974 3156.9918 3157.2020
redmass: 4.1254 2.8909 3.4171 3.9947 4.5457 2.9467 3.0580 3.6017 7.3647 1.0586 1.4960 1.7976 3.7533 3.9214 4.0008 2.5671 4.2711 4.3251 4.3599 3.6430 5.3533 2.4309 3.9868 4.1163 3.1274 3.3690 3.6095 3.3168 3.2865 3.2029 4.0698 3.2269 3.9171 2.0439 2.7530 4.6067 1.1806 1.6333 1.9505 1.5464 2.5867 2.1743 3.1761 2.4656 2.5268 1.6360 1.3485 1.7862 2.2565 3.4510 2.8791 1.8821 2.1686 1.8314 1.7289 2.6704 1.4569 1.6980 1.8198 1.2351 1.7524 1.3599 1.4729 1.1830 1.7514 2.0783 1.3316 1.9094 1.6700 1.3989 1.3515 1.3759 1.5447 2.0070 1.8974 2.7028 1.2159 1.3910 1.9909 2.3403 1.1043 1.1267 1.0427 1.0410 1.0468 1.1043 3.9940 1.1379 8.1697 1.1736 5.5525 7.8554 7.6633 6.3023 1.0773 1.0829 1.0679 1.0668 1.0350 1.0350 1.0617 1.0613 1.0989 1.0982 1.0936 1.0916 1.0993 1.0994 1.1018 1.1008 1.0854 1.0854 1.0964 1.0963
irintensity: 0.0719 0.8239 0.7318 0.4058 5.6421 0.0234 0.0253 6.4195 0.9303 0.0652 0.0418 0.4203 3.4573 0.1918 0.0865 0.6413 4.9093 3.1822 0.0303 1.6934 3.4916 2.1539 2.4924 12.6011 1.8525 0.1747 7.7295 6.5416 2.1011 1.2680 0.3929 1.6110 1.0963 14.3350 1.7862 2.4140 2.3465 36.7739 1.8319 7.6221 0.4184 27.5639 1.5020 3.8558 1.7673 0.7867 1.9185 7.7012 0.0711 0.0189 7.9908 3.1188 25.9322 8.4936 1.9823 1.0196 11.3510 10.4278 1.2679 15.3501 9.2681 2.7663 1.4126 0.2885 0.5294 27.6740 12.4512 62.6072 63.3137 3.9178 5.1556 0.0558 5.4500 0.1088 33.7725 0.9074 25.0525 6.4126 31.7420 24.0796 3.9462 5.8534 20.2976 7.9339 0.6477 1.4113 22.0455 41.8147 2.5417 12.7072 0.4571 409.6550 383.9465 12.2177 0.9469 25.7826 8.0989 21.5459 24.2041 42.2673 25.5630 24.2916 0.2370 0.7239 7.4565 11.0758 44.7164 60.6211 34.5725 30.2679 15.8668 9.2891 31.4632 7.3928
temp: 298.150 k
press: 1.00000 atm
elementType: 8 8 6 6 6 6 6 6 6 6 6 6 6 6 6 6 6 6 6 6 1 1 1 1 1 1 1 1 1 1 1 1 1 1 1 1 1 1 1 1
symmnumber: 1
zpe: 869254.0 jmol-1
zpe.correction: 0.331081 hartree
zpe.thermalcorrener: 0.349731 hartree
zpe.thermalcorrenthalpy: 0.350675 hartree
zpe.thermalcorrgfe: 0.283660 hartree
zpe.sumelectzpe: -846.876191 hartree
zpe.sumelectthermal: -846.857541 hartree
zpe.sumelectthermalent: -846.856597 hartree
zpe.sumelectthermalfe: -846.923612 hartree
dipole: -0.0013 8.5084 -0.0001
dipole: 8.5084
quadrupole: -135.8702 -135.0686 -119.6889
quadrupole: 0.0004 6.9886 0.0012
quadrupole: -5.6610 -4.8594 10.5203 0.0004 6.9886 0.0012
hfenergy: -847.2072719 hartree
pointgroup: C01 [X(C18H20O2)]
dipole: 0.0009045 -3.3474558 0.0013088 debye
polarizability: 328.5225571|0.0230846|266.9559303|13.7366783|-0.0527787|120.0095347 unknown
InChI: InChI=1S/C18H20O2/c1-3-13-14(4-2)16-8-6-12(20)10-18(16)17-9-11(19)5-7-15(13)17/h5-8,17-18H,3-4,9-10H2,1-2H3
charge 0 multiplicity 1
40 atoms
O  3.631168 3.163332 0.556334
O  -3.632649 3.160932 -0.5591
C  0.697893 0.874474 0.336613
C  -0.698084 0.873814 -0.337687
C  1.447347 -0.43375 0.069554
C  -1.446845 -0.434544 -0.069436
C  1.504122 2.131705 -0.08586
C  -1.504929 2.131045 0.08362
C  0.736849 -1.63801 -0.033259
C  -0.735725 -1.638364 0.03417
C  2.897306 -0.382274 0.08316
C  -2.896833 -0.383834 -0.082739
C  1.459903 -2.968947 -0.235851
C  -1.458147 -2.969513 0.237638
C  2.985425 2.101147 0.290982
C  -2.986295 2.099338 -0.292871
C  3.626946 0.779778 0.24962
C  -3.627124 0.777682 -0.250072
C  1.540309 -3.368452 -1.735264
C  -1.538711 -3.367931 1.737328
H  0.539591 0.926941 1.440081
H  -0.53978 0.925345 -1.441196
H  1.066482 3.049829 0.339019
H  1.454494 2.232913 -1.192206
H  -1.067879 3.048964 -0.342304
H  -1.455127 2.233446 1.189849
H  3.454171 -1.321362 -0.006237
H  -3.453179 -1.32313 0.007708
H  2.480833 -2.930652 0.177878
H  0.950275 -3.770867 0.325801
H  -2.478992 -2.932032 -0.17638
H  -0.947991 -3.7716 -0.323285
H  4.718918 0.756665 0.340256
H  -4.719109 0.75392 -0.340378
H  2.040146 -4.346856 -1.854202
H  2.110065 -2.616707 -2.310275
H  0.534335 -3.440786 -2.187638
H  -2.038132 -4.346472 1.856887
H  -2.108936 -2.616015 2.311651
H  -0.532809 -3.439474 2.189991
