program: Gaussian 09
title: 000249223
version: EM64L-G09RevD.01
frameworkgroup: C1[X(C13H22O2)]
method: RPBEPBE
basis: SDD
operation: Freq
keyword: #pfreq=noraman
keyword: PBEPBE/SDD
title: #p freq=noraman PBEPBE/SDD
converged: NO YES NO NO
title: Mulliken charges:
elementType: O O C C C C C C C C C C C C C H H H H H H H H H H H H H H H H H H H H H H
charge: -0.299416 -0.305651 0.370996 -0.112042 -0.069719 -0.489950 -0.480265 0.012541 -0.411743 -0.454366 -0.409201 -0.419066 -0.378277 -0.398866 -0.745917 0.230967 0.209014 0.210569 0.219915 0.211966 0.206201 0.192513 0.214610 0.215744 0.198487 0.223941 0.192496 0.210676 0.213327 0.194299 0.204030 0.188568 0.205059 0.212079 0.212891 0.210856 0.212733
chargesum: 0.00000
title: Mulliken charges with hydrogens summed into heavy atoms:
elementType: O O C C C C C C C C C C C C C
charge: -0.299416 -0.305651 0.370996 0.118924 0.139295 -0.059465 -0.062097 0.205054 0.018612 -0.031938 -0.006029 -0.011441 0.014321 0.018272 -0.109437
polarizability: 1.68090405e+02 1.84323173e-01 1.22769701e+02 4.89323843e-01 -1.20094440e+00 1.24329684e+02
1716.lowfreq: -27.4433 -8.5895 -0.0007 -0.0004 -0.0001 13.7271 53.5278 58.8250 98.1649
frequency: 53.4054 58.7240 98.0262 135.9735 185.9492 194.7315 215.0628 223.4794 268.2984 285.3146 304.7209 328.9630 359.5585 388.7168 412.3958 431.2951 456.4509 465.0846 478.1428 545.7285 583.0796 644.6262 682.7262 730.0691 766.5224 771.2494 772.7047 806.9244 843.4472 853.7352 868.9127 894.6462 901.6555 925.6943 930.0377 934.6562 958.2566 963.5963 991.7254 1011.3661 1012.0126 1048.6946 1057.7199 1068.9088 1083.4143 1092.5044 1108.7794 1112.1584 1141.7899 1149.2815 1157.3648 1188.9217 1190.7483 1241.4252 1243.2202 1249.2612 1256.2823 1264.1899 1272.9020 1297.0175 1300.7569 1308.8408 1316.4371 1323.5003 1329.2422 1331.4016 1337.9088 1338.4840 1346.2957 1355.8905 1362.1482 1369.5290 1388.4241 1445.3825 1452.2685 1455.6369 1459.4028 1465.1692 1469.8808 1470.2701 1476.1064 1476.6230 1477.6836 2940.3426 2949.1586 2965.2350 2965.8858 2973.3587 2978.7222 2983.0424 2988.8504 2991.0953 2997.6559 3000.7481 3025.5133 3030.6611 3036.3182 3037.4636 3041.6759 3052.4101 3053.3886 3060.7808 3064.0222 3064.5833 3067.5068
redmass: 3.7939 3.4689 2.6422 2.6090 2.5060 2.0963 1.1331 3.1759 2.3193 3.4965 2.8352 1.7312 3.0390 2.3116 2.3393 2.4098 2.7456 3.3889 2.9679 3.5826 2.4266 3.9955 3.0743 4.3129 2.3796 1.5371 2.4280 2.2093 2.7024 2.6076 2.2853 1.8972 2.0658 1.6727 1.5056 2.5846 2.5565 1.6254 2.8529 2.6108 1.7285 2.0002 1.7865 1.5419 1.3096 2.5611 1.1787 2.1781 1.8267 1.9929 2.2999 1.4943 1.9603 1.3561 1.3259 1.4255 1.3429 1.5542 1.2658 1.3298 1.2940 1.3455 1.3156 1.5923 1.5249 1.4749 1.5561 1.5445 1.5350 1.4612 1.5628 1.4679 1.2182 1.0869 1.0830 1.0854 1.0916 1.0903 1.0849 1.0839 1.0759 1.0641 1.0573 1.0824 1.0816 1.0640 1.0365 1.0589 1.0595 1.0641 1.0635 1.0623 1.0631 1.0615 1.0876 1.1005 1.0959 1.1000 1.0976 1.1020 1.1030 1.0994 1.1018 1.0992 1.1019
irintensity: 1.0765 0.8384 0.1055 0.7319 0.7296 2.0696 0.1208 0.0964 0.5186 1.7231 1.8774 0.8299 3.9305 2.1068 0.3055 2.3470 7.2099 4.7180 0.8136 1.7657 5.0144 4.5031 1.1636 8.0325 4.3034 0.8101 3.2629 5.0343 23.2123 10.7692 3.9075 7.2388 27.3322 4.3390 3.9851 18.1298 39.0251 4.7040 4.2080 127.8945 30.5418 78.0128 4.5928 5.1094 1.4072 3.7718 1.4048 3.9617 11.3744 13.7651 9.1316 4.3393 5.4393 1.4723 0.9409 21.5298 14.8735 5.0395 1.6216 4.4035 6.5930 2.1200 2.0781 5.4258 1.8836 6.5397 1.9516 0.9704 2.6804 9.0523 13.9187 4.9181 9.3590 8.6146 9.5995 4.8303 13.0156 12.9885 9.1977 12.9340 9.9550 16.4066 8.2930 21.1830 34.8509 49.1801 25.7211 37.1133 60.3190 44.1679 30.4429 21.5285 10.7851 25.9573 26.7543 51.0455 54.0874 23.3123 34.9657 23.8749 30.4259 32.7712 112.5875 42.3846 61.8525
temp: 298.150 k
press: 1.00000 atm
elementType: 8 8 6 6 6 6 6 6 6 6 6 6 6 6 6 1 1 1 1 1 1 1 1 1 1 1 1 1 1 1 1 1 1 1 1 1 1
symmnumber: 1
zpe: 863033.6 jmol-1
zpe.correction: 0.328712 hartree
zpe.thermalcorrener: 0.342765 hartree
zpe.thermalcorrenthalpy: 0.343710 hartree
zpe.thermalcorrgfe: 0.288713 hartree
zpe.sumelectzpe: -657.832336 hartree
zpe.sumelectthermal: -657.818283 hartree
zpe.sumelectthermalent: -657.817339 hartree
zpe.sumelectthermalfe: -657.872336 hartree
dipole: -1.0043 0.6581 -0.4296
dipole: 1.2753
quadrupole: -84.8519 -97.1050 -89.5489
quadrupole: -2.1640 1.6747 -0.7449
quadrupole: 5.6500 -6.6030 0.9530 -2.1640 1.6747 -0.7449
hfenergy: -658.1610485 hartree
pointgroup: C01 [X(C13H22O2)]
dipole: -0.397307 0.2521899 -0.1740568 debye
polarizability: 168.0881254|0.4959996|122.7181017|0.3731178|-1.1605752|124.3835626 unknown
InChI: InChI=1S/C13H22O2/c1-10-6-8-13(9-7-10)14-11-4-2-3-5-12(11)15-13/h10-12H,2-9H2,1H3
charge 0 multiplicity 1
37 atoms
O  -0.545106 -1.697562 -0.254238
O  -0.227174 0.657821 -0.258371
C  0.497688 -0.630849 -0.120546
C  -1.861477 -1.028894 -0.443815
C  -1.460189 0.347063 -1.030814
C  1.522241 -0.819963 -1.253956
C  1.149919 -0.674423 1.26773
C  3.383942 0.093457 0.260717
C  -2.633109 -0.939748 0.88907
C  -2.478897 1.484043 -0.876979
C  2.700306 0.173873 -1.128626
C  2.329509 0.321918 1.373678
C  -3.774347 0.103332 0.821258
C  -3.191278 1.497709 0.494648
C  4.551596 1.095996 0.375743
H  -2.414647 -1.63687 -1.182754
H  -1.187031 0.224919 -2.101015
H  1.011266 -0.706142 -2.228238
H  1.890669 -1.863045 -1.202118
H  1.507509 -1.708801 1.435302
H  0.380646 -0.460165 2.031092
H  3.790348 -0.935489 0.382059
H  -1.924804 -0.640498 1.683956
H  -3.015527 -1.942329 1.155161
H  -3.236296 1.364052 -1.678309
H  -1.962822 2.443764 -1.067133
H  3.44052 -0.022421 -1.928957
H  2.32077 1.204775 -1.279989
H  1.938758 1.356084 1.292123
H  2.803448 0.230267 2.370593
H  -4.31848 0.125103 1.784403
H  -4.512488 -0.184163 0.043014
H  -3.989021 2.2647 0.486799
H  -2.469124 1.782553 1.284134
H  5.315364 0.918103 -0.404641
H  4.186748 2.134983 0.259756
H  5.049768 1.022148 1.360864
