program: Gaussian 09
title: 000249217
version: EM64L-G09RevD.01
frameworkgroup: C1[X(C12H18O5)]
method: RPBEPBE
basis: SDD
operation: Freq
keyword: #pfreq=noraman
keyword: PBEPBE/SDD
title: #p freq=noraman PBEPBE/SDD
converged: YES YES NO NO
title: Mulliken charges:
elementType: O O O O O C C C C C C C C C C C C H H H H H H H H H H H H H H H H H H
charge: -0.277350 -0.216918 -0.193983 -0.258693 -0.234095 0.204772 -0.455661 -0.467153 -0.402149 -0.403136 -0.391083 0.150184 0.162789 -0.681798 0.315746 -0.262282 -0.661721 0.209924 0.261117 0.217854 0.221839 0.238181 0.202265 0.201673 0.240973 0.210129 0.185768 0.243459 0.232091 0.234681 0.227872 0.238349 0.222023 0.254461 0.229872
chargesum: 0.00000
title: Mulliken charges with hydrogens summed into heavy atoms:
elementType: O O O O O C C C C C C C C C C C C
charge: -0.277350 -0.216918 -0.193983 -0.258693 -0.234095 0.204772 0.015380 -0.027460 0.038297 0.039510 0.004813 0.150184 0.162789 0.028433 0.315746 0.203939 0.044634
polarizability: 1.84346248e+02 -5.70638024e+00 1.27409773e+02 6.69962043e+00 -3.43468415e+00 1.16158136e+02
1716.lowfreq: -17.5236 -8.3404 0.0002 0.0005 0.0009 7.4183 20.9568 46.7757 55.2912
frequency: 20.6520 46.6574 55.2090 78.7239 98.9221 104.6851 140.0125 181.9569 193.1393 205.3635 233.6391 245.5432 255.9501 272.0605 299.9155 321.3982 332.6575 350.0038 355.5322 387.1397 438.2908 446.7268 494.2388 510.4163 572.2147 623.5695 660.2194 686.1469 691.2269 720.1295 756.1027 787.3285 810.1751 813.2474 818.3138 835.9339 849.3999 890.2781 892.1002 909.2070 940.2166 952.7289 1004.8266 1016.1284 1020.5781 1050.4696 1075.1861 1090.6879 1098.7652 1099.7458 1126.3840 1135.8981 1156.6415 1165.2226 1193.8733 1213.9348 1228.3181 1256.5836 1266.5110 1275.9556 1297.2743 1313.6256 1333.5788 1337.9513 1345.7238 1352.9957 1358.5228 1393.5807 1394.4142 1453.8634 1456.6724 1457.9789 1461.5863 1463.4065 1464.1387 1464.4930 1473.3321 1479.3323 1484.5140 1633.1511 1706.7829 2965.4545 2987.8410 2991.8938 2992.7771 2994.3365 2996.0736 3016.9970 3034.0748 3036.2869 3045.9532 3052.5491 3061.0354 3077.3224 3091.4936 3098.0875 3122.4549 3124.4141 3130.8038
redmass: 4.6977 3.7960 3.6698 4.7526 4.2515 3.4070 3.7378 1.9184 3.8672 1.0832 1.5852 2.4789 2.4663 2.6947 3.9099 3.7496 5.5894 1.9370 5.4755 5.1233 3.4259 3.5893 1.9227 3.3684 5.5146 3.9421 8.3348 5.8555 5.0955 8.2501 2.9533 1.4555 2.3655 2.3374 1.9107 4.6150 2.6664 2.3218 2.1495 2.3460 1.3917 3.2707 2.5082 2.2235 4.3071 2.0134 1.4651 2.6349 1.5628 2.4423 2.5191 1.7574 1.6930 2.5083 4.3321 1.9696 4.5221 1.3415 1.2408 1.1240 1.7282 1.3253 1.3519 1.3813 1.4332 1.2808 1.4232 1.2306 1.2488 1.0462 1.0673 1.0831 1.0852 1.0832 1.0431 1.0835 1.0821 1.0910 1.0519 10.4120 12.2137 1.0640 1.0601 1.0625 1.0627 1.0632 1.0362 1.0354 1.0598 1.0958 1.1012 1.1024 1.1029 1.0999 1.0974 1.1030 1.1010 1.1066 1.1003
irintensity: 1.3747 0.5363 0.0635 3.0887 0.4249 0.8300 1.2361 2.2464 2.5886 0.1685 0.8037 1.6179 3.1749 1.6024 4.9083 11.7151 9.6026 0.0758 5.0662 1.7593 2.0277 4.7257 0.6279 6.1783 15.3195 3.3826 2.8577 11.5782 1.5834 12.2797 4.1219 1.0784 1.2438 11.8728 9.2899 34.0933 13.5343 33.8219 9.0057 6.6346 4.2216 58.6446 36.0789 51.3143 299.9764 16.9460 1.3571 311.4207 0.0671 92.1148 74.2024 0.8142 34.7692 10.9534 37.8003 1.6410 131.0329 4.0483 2.0037 4.7445 12.0216 0.2856 15.7734 0.7377 0.3164 0.2413 2.1570 26.9683 33.3103 9.4810 6.9406 14.8858 2.7665 5.8666 13.4719 17.3036 23.1742 5.3596 12.7084 134.5236 226.5254 40.3360 10.4702 20.5667 34.3793 27.4621 16.4893 5.1085 26.3829 59.6634 37.9686 8.6583 48.9733 12.4217 30.6176 1.1833 15.3084 28.2107 8.9743
temp: 298.150 k
press: 1.00000 atm
elementType: 8 8 8 8 8 6 6 6 6 6 6 6 6 6 6 6 6 1 1 1 1 1 1 1 1 1 1 1 1 1 1 1 1 1 1
symmnumber: 1
zpe: 751852.1 jmol-1
zpe.correction: 0.286365 hartree
zpe.thermalcorrener: 0.303663 hartree
zpe.thermalcorrenthalpy: 0.304607 hartree
zpe.thermalcorrgfe: 0.240831 hartree
zpe.sumelectzpe: -842.874809 hartree
zpe.sumelectthermal: -842.857512 hartree
zpe.sumelectthermalent: -842.856567 hartree
zpe.sumelectthermalfe: -842.920343 hartree
dipole: -2.2656 -0.2297 -3.4585
dipole: 4.1409
quadrupole: -80.6941 -97.8794 -111.1435
quadrupole: 1.4382 -3.0008 0.1031
quadrupole: 15.8782 -1.3071 -14.5712 1.4382 -3.0008 0.1031
hfenergy: -843.1611744 hartree
pointgroup: C01 [X(C12H18O5)]
dipole: 0.8148455 1.1013766 -0.8815627 debye
polarizability: 183.2111555|3.5510266|117.9050929|-11.6529441|4.7718759|126.797909 unknown
InChI: InChI=1S/C12H18O5/c1-3-15-9(13)11(2)16-10(14)12(17-11)7-5-4-6-8-12/h3-8H2,1-2H3
charge 0 multiplicity 1
35 atoms
O  -0.144311 0.528621 -1.368071
O  0.395747 -1.476572 -0.239858
O  -1.521432 -1.776823 1.038539
O  3.124529 0.713103 -0.848037
O  1.753194 0.674342 1.037844
C  -1.282907 0.249251 -0.429054
C  -1.446343 1.411586 0.583077
C  -2.551308 0.081931 -1.304449
C  -2.743254 1.281303 1.419882
C  -3.84307 -0.037046 -0.45975
C  -3.990056 1.155356 0.513906
C  0.971452 -0.389767 -1.065235
C  -0.880377 -1.078427 0.242765
C  1.536191 -0.960768 -2.352096
C  1.97973 0.370857 -0.153848
C  4.158243 1.497511 -0.090452
C  5.086642 0.555022 0.677963
H  -1.481515 2.341976 -0.017693
H  -0.557296 1.466368 1.234128
H  -2.4316 -0.792164 -1.97123
H  -2.604241 0.981085 -1.949185
H  -2.674593 0.392388 2.075354
H  -2.830467 2.164992 2.080159
H  -4.712389 -0.090179 -1.142489
H  -3.82261 -0.98098 0.116958
H  -4.897947 1.026644 1.1331
H  -4.122893 2.09311 -0.06538
H  1.918722 -0.145208 -2.985137
H  2.363163 -1.656944 -2.137677
H  0.734224 -1.495838 -2.885783
H  4.68546 2.052859 -0.881869
H  3.634592 2.19439 0.586878
H  5.889546 1.141714 1.161331
H  4.536047 0.013432 1.465048
H  5.556525 -0.177225 -0.000736
