program: Gaussian 09
title: 000249215
version: EM64L-G09RevD.01
frameworkgroup: C1[X(C11H21NO4)]
method: RPBEPBE
basis: SDD
operation: Freq
keyword: #p
keyword: freq=noraman
keyword: PBEPBE/SDD
title: #p freq=noraman PBEPBE/SDD
converged: YES YES NO NO
title: Mulliken charges:
elementType: O O O O N C C C C C C C C C C C H H H H H H H H H H H H H H H H H H H H H
charge: -0.257362 -0.299322 -0.257792 -0.270335 -0.129588 -0.526556 -0.347573 -0.384038 0.256912 -0.522168 -0.661745 -0.646623 0.257066 -0.260314 -0.254602 -0.497068 0.234828 0.268168 0.201462 0.258198 0.222458 0.244852 0.253032 0.286758 0.203467 0.252862 0.215929 0.219012 0.223241 0.219549 0.215422 0.247959 0.206901 0.186476 0.205944 0.198809 0.235782
chargesum: 0.00000
title: Mulliken charges with hydrogens summed into heavy atoms:
elementType: O O O O N C C C C C C C C C C C
charge: -0.257362 -0.299322 -0.257792 -0.270335 -0.129588 -0.023561 0.112088 0.083272 0.256912 0.017621 0.010513 0.015179 0.257066 0.203067 0.138776 0.143466
polarizability: 1.83627628e+02 3.07109649e+00 1.25110066e+02 2.85195775e+00 4.70805066e+00 1.20469866e+02
1716.lowfreq: -4.2603 -0.0009 -0.0007 0.0005 1.1397 3.0440 12.6696 20.2271 35.1430
frequency: 11.5516 20.1816 35.1401 45.3715 50.0445 56.7679 72.5409 86.8710 97.8306 126.6363 142.9097 165.5269 183.2968 202.0067 205.7354 227.5140 230.5478 266.2367 286.3071 308.3234 320.9296 368.8027 419.2233 452.1890 493.4982 517.1820 560.2980 575.3107 595.4412 671.9057 748.1308 776.4885 785.4146 794.7274 813.4898 827.6281 907.8774 928.6446 942.5984 990.1388 1013.2260 1015.1558 1022.4002 1064.6217 1070.8329 1079.3552 1085.8618 1097.1578 1108.3032 1122.5010 1133.0137 1144.2962 1158.2222 1161.3349 1202.4876 1213.2771 1240.7428 1250.3970 1251.7424 1297.6675 1308.7745 1339.6037 1347.4479 1357.1740 1363.6239 1383.3677 1388.1458 1389.7241 1419.5964 1437.8072 1445.1365 1450.6597 1452.9077 1457.6424 1458.3154 1460.3091 1466.8948 1468.9294 1477.7348 1478.3014 1482.9735 1494.7839 1580.9491 1632.3703 2918.6161 2927.9226 2978.9452 2982.6812 2984.4293 2985.5650 2997.6065 2998.4046 2999.6464 3003.7707 3019.2419 3045.4267 3062.2864 3066.1568 3078.9969 3083.3881 3084.0505 3089.2620 3091.7909 3101.7883 3105.9115
redmass: 3.9957 3.6680 5.2951 3.8791 3.7720 2.6580 2.7496 2.6946 4.5395 2.9420 2.3947 2.9531 2.2118 1.8613 1.3295 1.4224 1.7085 2.1628 3.2217 2.6929 2.8492 3.1123 2.6647 3.3117 2.9464 2.9041 3.0324 3.5593 3.3054 5.0800 2.6136 1.1708 1.2998 2.7269 2.2194 2.5724 2.4374 4.3189 2.3466 2.5654 2.2501 2.4633 2.6898 2.8929 2.0782 1.9268 2.9238 1.7865 1.6832 1.8542 2.0597 1.9756 1.4176 1.5305 1.1187 2.8517 1.2864 1.2483 1.2514 1.3064 1.3355 1.3195 1.3614 1.3009 1.5838 1.2162 1.2104 1.5075 2.4857 1.1628 1.0885 1.1131 1.0815 1.0529 1.1240 1.0731 1.0517 1.0441 1.0576 1.0671 1.0550 1.1059 6.2423 9.5026 1.0475 1.0453 1.1007 1.0360 1.0368 1.0607 1.1025 1.0647 1.0651 1.0640 1.0603 1.0966 1.0975 1.0993 1.0956 1.0988 1.0990 1.1056 1.1017 1.1018 1.0969
irintensity: 2.1451 0.0939 0.6588 5.2605 1.3504 3.3515 0.7029 5.0478 3.4595 0.8251 2.1655 4.6378 4.6168 2.2722 0.7844 4.0626 10.8097 5.5987 16.8940 1.0597 1.9192 10.7445 4.1095 6.7049 14.9373 4.2732 6.5926 22.2363 1.8076 2.7457 1.4657 4.8168 15.5177 9.8021 15.3982 16.1713 1.7110 27.0833 16.0720 37.4971 5.0673 8.2187 55.4623 80.1868 13.7855 12.3809 7.0892 22.6846 14.3295 19.0914 243.5778 111.1137 2.2004 70.0644 7.9020 25.1465 85.6663 44.4048 34.7213 1.6856 99.6353 17.5700 13.9571 9.3802 25.1823 15.1936 26.3748 14.1371 106.6755 0.3168 5.6455 66.1250 15.7666 12.1711 11.6534 18.1880 7.7402 14.3789 7.8196 5.7640 10.7037 9.9252 269.0861 154.9194 50.9797 109.6014 53.2167 27.2645 25.4628 8.7962 68.5155 39.3646 43.9032 30.9934 31.8662 10.2552 1.2408 10.7715 9.4801 36.3744 47.0070 19.3745 44.0621 31.7777 28.6738
temp: 298.150 k
press: 1.00000 atm
elementType: 8 8 8 8 7 6 6 6 6 6 6 6 6 6 6 6 1 1 1 1 1 1 1 1 1 1 1 1 1 1 1 1 1 1 1 1 1
symmnumber: 1
zpe: 820595.9 jmol-1
zpe.correction: 0.312548 hartree
zpe.thermalcorrener: 0.332509 hartree
zpe.thermalcorrenthalpy: 0.333453 hartree
zpe.thermalcorrgfe: 0.259756 hartree
zpe.sumelectzpe: -786.106929 hartree
zpe.sumelectthermal: -786.086968 hartree
zpe.sumelectthermalent: -786.086024 hartree
zpe.sumelectthermalfe: -786.159721 hartree
dipole: -0.1611 1.8400 -0.0149
dipole: 1.8471
quadrupole: -61.3845 -98.5251 -103.1931
quadrupole: 13.7190 8.0632 -3.1098
quadrupole: 26.3164 -10.8242 -15.4922 13.7190 8.0632 -3.1098
hfenergy: -786.4194771 hartree
pointgroup: C01 [X(C11H21N1O4)]
dipole: 0.0514884 -0.4143591 -0.5947717 debye
polarizability: 183.717548|3.5681687|126.3851298|0.0583831|3.6948011|119.1048817 unknown
InChI: InChI=1S/C11H21NO4/c1-4-12(5-2)10(13)6-7-11(14)16-9-8-15-3/h4-9H2,1-3H3
charge 0 multiplicity 1
37 atoms
O  2.647817 0.243443 0.623803
O  -2.163906 1.843786 0.671246
O  1.324035 -1.389096 1.625802
O  5.228433 -0.179024 -0.841741
N  -3.472457 0.07451 -0.069182
C  -1.026677 -0.302799 0.304574
C  -4.671194 0.949514 -0.0622
C  -3.667006 -1.341051 -0.454977
C  -2.254824 0.623071 0.311751
C  0.275093 0.507582 0.425266
C  -5.405713 0.936923 1.295477
C  -3.611845 -1.570749 -1.982798
C  1.420333 -0.332177 0.955657
C  3.858874 -0.464929 1.124228
C  5.072833 0.243146 0.55027
C  6.305081 0.538167 -1.51981
H  -1.00659 -0.929622 -0.605267
H  -1.087029 -1.001491 1.163299
H  -5.344534 0.614432 -0.873825
H  -4.335375 1.975319 -0.289066
H  -4.652487 -1.66302 -0.067273
H  -2.914988 -1.969486 0.050848
H  0.570709 0.965398 -0.533606
H  0.097125 1.355793 1.116121
H  -5.733075 -0.082378 1.57266
H  -4.739866 1.319954 2.087085
H  -6.301939 1.583055 1.25322
H  -4.367476 -0.955586 -2.503537
H  -2.620054 -1.304252 -2.389245
H  -3.809709 -2.631999 -2.221428
H  3.855222 -0.429943 2.229231
H  3.825835 -1.519786 0.801196
H  4.939526 1.344881 0.619154
H  5.974722 -0.039463 1.1405
H  6.112968 1.632097 -1.544663
H  7.288885 0.359112 -1.033637
H  6.332457 0.149371 -2.549636
