program: Gaussian 09
title: 000249213
version: EM64L-G09RevD.01
frameworkgroup: C1[X(C11H21NO2)]
method: RPBEPBE
basis: SDD
operation: Freq
keyword: #p
keyword: freq=noraman
keyword: PBEPBE/SDD
title: #p freq=noraman PBEPBE/SDD
converged: YES YES NO NO
title: Mulliken charges:
elementType: O O N C C C C C C C C C C C H H H H H H H H H H H H H H H H H H H H H
charge: -0.266841 -0.232653 -0.063305 -0.398466 -0.397677 -0.388208 -0.367976 -0.365312 -0.453122 0.242775 -0.298037 -0.351170 -0.346015 -0.687446 0.212602 0.191457 0.190312 0.208105 0.187009 0.213660 0.252282 0.161130 0.167588 0.211143 0.214318 0.248906 0.203355 0.224747 0.227412 0.219812 0.202712 0.192869 0.215072 0.210691 0.218275
chargesum: 0.00000
title: Mulliken charges with hydrogens summed into heavy atoms:
elementType: O O N C C C C C C C C C C C
charge: -0.266841 -0.232653 -0.063305 0.002203 0.006382 0.010209 0.045436 0.013419 0.010101 0.242775 0.149186 0.076931 0.049566 -0.043408
polarizability: 1.67090560e+02 1.53762366e+00 1.20805456e+02 1.42618871e-01 3.60712169e+00 1.06625671e+02
1716.lowfreq: -6.3149 -4.0823 0.0008 0.0009 0.0009 6.9713 16.6585 33.8492 45.5548
frequency: 15.4979 33.8422 45.4786 62.3077 77.0304 101.0530 113.4352 176.9553 195.3171 225.6842 229.2486 239.7224 281.2461 293.4303 324.0933 380.9427 392.5995 417.6702 447.3099 485.8176 549.1222 582.1774 662.0404 744.4702 760.4306 797.6501 805.3246 838.7786 854.0389 857.4199 898.6479 907.9206 931.3829 947.8115 959.0147 981.2567 1003.5963 1033.0295 1050.8668 1076.5493 1078.1493 1100.6697 1117.8083 1118.8546 1130.0806 1153.9550 1165.1629 1168.1620 1200.2508 1227.2262 1252.9565 1265.2798 1271.4065 1275.4359 1290.0387 1290.3373 1296.4347 1330.8449 1337.7931 1342.2259 1345.8731 1350.7676 1365.8398 1373.1057 1388.5495 1391.9329 1439.1617 1451.4568 1453.8103 1461.0851 1465.5145 1467.3616 1471.1368 1476.8436 1477.7516 1477.9926 1488.6727 1656.4899 2810.1828 2816.8948 2833.2466 2965.8097 2968.7283 2975.7494 2985.8461 2990.2222 2991.3801 3013.6918 3015.9259 3020.0183 3032.9217 3036.6794 3048.0364 3051.1679 3056.7711 3067.9743 3073.2672 3076.2403 3099.4531
redmass: 3.7822 3.8053 3.4318 1.9670 3.4104 3.5055 2.3699 2.6542 3.1443 2.2083 1.5657 1.9358 2.6522 2.0767 4.5375 1.7404 3.3054 3.4327 2.9443 2.5226 3.2574 2.2237 4.5439 1.0735 3.7735 1.3150 1.4654 3.3717 2.6541 1.5229 1.8479 2.4572 2.3093 1.6432 1.2968 2.1000 2.5499 3.6994 2.0723 2.3953 1.5628 3.0212 2.3224 2.6313 2.3215 1.3043 1.7459 2.2300 1.3967 1.3176 1.4181 1.2568 1.2766 1.3340 1.1288 1.0879 1.3811 1.3059 1.4715 1.4437 1.4630 1.4929 1.3810 1.4371 1.4308 1.2216 1.0992 1.0907 1.0924 1.0874 1.0829 1.0963 1.0678 1.0522 1.0537 1.0968 1.0862 9.3646 1.0714 1.0708 1.0693 1.0625 1.0586 1.0366 1.0621 1.0612 1.0597 1.0999 1.0872 1.0578 1.0959 1.0844 1.1032 1.1030 1.1027 1.0885 1.1011 1.0995 1.1083
irintensity: 0.1025 1.1068 0.0855 0.1230 0.4442 1.9194 0.8679 0.9300 1.7868 2.0883 0.9420 0.6295 9.1167 5.2958 7.7169 3.4991 3.5192 4.5153 0.4408 0.8797 6.5448 0.0781 6.8459 9.9417 9.2404 1.3927 0.2953 9.3214 5.9904 7.0807 9.1574 1.6350 14.4133 6.6885 4.2562 6.8185 60.1574 14.2902 9.7241 3.1882 35.2077 392.9149 18.3635 23.4989 60.6056 14.2918 6.2445 18.7291 23.0560 2.1147 3.1471 1.9625 3.7735 21.6734 0.8073 1.2818 7.6422 1.2478 0.6086 0.4084 1.9222 2.2011 5.8575 1.6319 7.6422 10.2319 19.8433 5.6294 7.3318 14.2094 3.1525 13.8460 0.4389 8.4017 8.1196 6.8304 18.7226 147.6441 46.4180 79.0730 183.3616 40.4029 31.5682 30.3544 30.1321 36.2705 22.8214 7.8081 56.7633 52.6771 62.4594 11.7055 25.0679 7.5598 84.7137 13.9190 63.6684 51.9236 36.8605
temp: 298.150 k
press: 1.00000 atm
elementType: 8 8 7 6 6 6 6 6 6 6 6 6 6 6 1 1 1 1 1 1 1 1 1 1 1 1 1 1 1 1 1 1 1 1 1
symmnumber: 1
zpe: 808238.0 jmol-1
zpe.correction: 0.307842 hartree
zpe.thermalcorrener: 0.323612 hartree
zpe.thermalcorrenthalpy: 0.324556 hartree
zpe.thermalcorrgfe: 0.262373 hartree
zpe.sumelectzpe: -635.815749 hartree
zpe.sumelectthermal: -635.799978 hartree
zpe.sumelectthermalent: -635.799034 hartree
zpe.sumelectthermalfe: -635.861218 hartree
dipole: -0.7396 -0.7893 -1.6740
dipole: 1.9931
quadrupole: -74.5391 -86.0129 -89.2391
quadrupole: 0.5552 -2.5560 -1.7087
quadrupole: 8.7245 -2.7492 -5.9754 0.5552 -2.5560 -1.7087
hfenergy: -636.1235901 hartree
pointgroup: C01 [X(C11H21N1O2)]
dipole: 0.287842 -0.4287417 0.5900897 debye
polarizability: 166.950676|-2.8239603|121.7352928|-1.0595289|-0.9042788|105.8357188 unknown
InChI: InChI=1S/C11H21NO2/c1-2-3-9-14-11(13)10-12-7-5-4-6-8-12/h2-10H2,1H3
charge 0 multiplicity 1
35 atoms
O  1.599485 -1.394033 -0.109015
O  0.681049 0.575161 -0.965483
N  -1.932815 -0.30332 0.032652
C  -4.526563 1.029714 0.43578
C  -3.236816 1.822135 0.124763
C  -4.418438 -0.400209 -0.140548
C  -1.989023 1.063129 0.617884
C  -3.142033 -1.099133 0.368803
C  -0.700291 -1.025188 0.372432
C  0.552433 -0.486524 -0.319773
C  2.933691 -1.017432 -0.66744
C  3.7275 -0.160227 0.327242
C  5.149711 0.150112 -0.197419
C  5.966679 1.008033 0.792661
H  -3.147387 1.972602 -0.968075
H  -3.266362 2.821521 0.600024
H  -5.303361 -1.004566 0.138123
H  -4.37703 -0.351076 -1.245653
H  -4.669778 0.973286 1.53527
H  -5.411685 1.548225 0.020996
H  -1.076609 1.60348 0.316427
H  -2.00862 1.009387 1.740685
H  -3.231207 -1.2569 1.477994
H  -3.045538 -2.097246 -0.0996
H  -0.479808 -1.039276 1.473385
H  -0.800935 -2.084806 0.07354
H  3.795251 -0.693097 1.29571
H  3.183568 0.78642 0.507421
H  2.779026 -0.479568 -1.620438
H  3.424938 -1.987388 -0.852329
H  5.076686 0.677553 -1.169946
H  5.686948 -0.800178 -0.394306
H  5.469749 1.978425 0.978414
H  6.075954 0.494471 1.766323
H  6.98013 1.215613 0.4036
