program: Gaussian 09
title: 000249211
version: EM64L-G09RevD.01
frameworkgroup: C1[X(C11H18O3)]
method: RPBEPBE
basis: SDD
operation: Freq
keyword: #pfreq=noraman
keyword: PBEPBE/SDD
title: #p freq=noraman PBEPBE/SDD
converged: NO YES NO NO
title: Mulliken charges:
elementType: O O O C C C C C C C C C C C H H H H H H H H H H H H H H H H H H
charge: -0.268695 -0.254016 -0.197284 -0.002102 -0.475027 0.020761 -0.417293 -0.436957 -0.412956 -0.741710 0.282948 -0.596588 0.224918 -0.756454 0.201719 0.217450 0.205897 0.236182 0.202845 0.187630 0.203609 0.235837 0.206949 0.204078 0.215660 0.210480 0.218506 0.237187 0.279656 0.250061 0.286051 0.230657
chargesum: 0.00000
title: Mulliken charges with hydrogens summed into heavy atoms:
elementType: O O O C C C C C C C C C C C
charge: -0.268695 -0.254016 -0.197284 0.199617 -0.051679 0.256943 -0.026818 0.002489 -0.001929 -0.097064 0.282948 -0.079745 0.224918 0.010315
polarizability: 1.62116026e+02 1.38756479e-01 1.22018381e+02 -2.00998125e+00 3.05626901e+00 9.96854960e+01
1716.lowfreq: -22.5048 -7.6586 -0.0007 0.0003 0.0007 7.0504 15.6088 36.2580 56.0293
frequency: 7.9231 36.1423 55.8399 63.6078 90.7457 140.6435 152.2191 163.0824 203.0859 212.5554 242.7078 260.2776 281.5927 352.3981 360.6604 396.4278 433.5599 446.5860 461.6028 475.3595 508.7671 552.8693 592.7826 706.8855 771.8314 793.5976 817.0441 856.4093 860.3489 873.6311 888.6052 903.7926 934.7553 946.4303 976.4449 979.6982 1012.2845 1032.6846 1048.4499 1072.4892 1094.8268 1101.3193 1113.7114 1160.0319 1173.7274 1181.5615 1213.6255 1223.2805 1255.1812 1258.0113 1269.2503 1284.3587 1297.5841 1307.5111 1331.6206 1335.9209 1343.3011 1347.7034 1357.7100 1375.2602 1388.1601 1430.6045 1447.0344 1454.9083 1459.3511 1462.0853 1468.5775 1473.0903 1476.8246 1478.9643 1614.2842 1645.9803 2946.6013 2963.8833 2968.8993 2974.6578 2979.4712 2983.0612 2989.1953 3007.1741 3013.3905 3029.4839 3042.0972 3049.8295 3062.9837 3063.0995 3066.3392 3069.1117 3121.7951 3127.6071
redmass: 4.3074 5.1961 5.1516 4.2224 4.0941 2.3928 2.0224 1.3282 1.3159 2.0111 4.2216 2.6888 2.4349 3.0935 2.5507 3.5906 1.7795 2.9971 2.9172 3.5125 2.6154 3.1662 3.5812 4.9551 1.9843 3.7813 2.8912 1.5657 1.8267 1.9359 2.0738 1.9743 3.1491 2.3033 1.4516 1.7366 1.9678 1.8600 1.4226 1.2914 2.1359 2.1226 2.4274 2.3815 2.1673 2.1180 1.3785 2.2632 1.3109 1.3401 1.2077 1.4720 1.3414 1.2481 1.3764 1.4127 1.5616 1.6783 1.5029 1.2671 1.2141 1.0864 1.0592 1.0726 1.0874 1.0892 1.0836 1.0543 1.0653 1.0784 9.5303 7.7450 1.0810 1.0618 1.0379 1.0637 1.0379 1.0611 1.0633 1.0636 1.0836 1.0979 1.0993 1.1012 1.0987 1.0964 1.1012 1.0994 1.0976 1.1009
irintensity: 1.8308 2.3437 3.5240 0.2104 3.8408 0.0579 0.7127 0.2751 1.9402 1.7313 10.8807 3.4185 1.8884 0.6301 4.7139 0.5657 0.5168 6.2811 1.4760 8.1288 4.2516 5.1756 10.0278 3.8557 0.3809 14.5153 6.9992 4.1305 0.1822 8.3220 10.2465 2.3996 32.8251 59.1966 10.5273 2.9359 19.7424 6.6893 21.5244 43.3451 71.4542 213.8658 7.9674 2.7873 9.6169 293.8949 5.1185 72.2537 3.4236 6.4327 1.0441 123.5437 18.6418 7.4030 0.7934 1.4495 0.2538 4.6198 4.3723 85.4077 10.1616 16.3313 31.7310 28.9266 1.6043 7.9268 13.2277 6.7232 15.1902 11.1965 210.0306 115.3925 9.5510 30.1121 47.8862 32.3091 7.9172 25.6242 15.1431 2.8973 15.7407 48.5704 45.7386 16.2359 12.0621 19.7115 87.6831 42.7387 3.6652 7.9989
temp: 298.150 k
press: 1.00000 atm
elementType: 8 8 8 6 6 6 6 6 6 6 6 6 6 6 1 1 1 1 1 1 1 1 1 1 1 1 1 1 1 1 1 1
symmnumber: 1
zpe: 713278.5 jmol-1
zpe.correction: 0.271673 hartree
zpe.thermalcorrener: 0.287042 hartree
zpe.thermalcorrenthalpy: 0.287986 hartree
zpe.thermalcorrgfe: 0.226654 hartree
zpe.sumelectzpe: -654.544542 hartree
zpe.sumelectthermal: -654.529174 hartree
zpe.sumelectthermalent: -654.528230 hartree
zpe.sumelectthermalfe: -654.589561 hartree
dipole: -2.5286 -2.0741 0.9186
dipole: 3.3970
quadrupole: -83.3927 -92.3607 -83.5951
quadrupole: -10.5652 3.1193 -3.1607
quadrupole: 3.0568 -5.9112 2.8544 -10.5652 3.1193 -3.1607
hfenergy: -654.8162156 hartree
pointgroup: C01 [X(C11H18O3)]
dipole: 1.1060488 0.7263855 0.1876431 debye
polarizability: 161.3710826|-4.6780662|121.8280426|-4.5668305|-4.5480613|100.6207774 unknown
InChI: InChI=1S/C11H18O3/c1-8-4-3-5-10(6-8)14-11(13)7-9(2)12/h8,10H,3-7H2,1-2H3
charge 0 multiplicity 1
32 atoms
O  -0.40645 -0.219481 0.977881
O  -1.55353 1.287932 -0.387964
O  -4.407961 -1.359876 0.942013
C  3.027447 -1.202329 -0.422127
C  1.677027 -1.309634 0.338217
C  0.842957 -0.037391 0.147428
C  3.7916 0.073458 0.018316
C  1.587233 1.226762 0.607413
C  2.932605 1.348989 -0.15061
C  3.87607 -2.475702 -0.218974
C  -1.521866 0.516186 0.602463
C  -2.684347 0.244814 1.554468
C  -3.972426 -0.188102 0.813636
C  -4.660717 0.864981 -0.033762
H  2.802379 -1.103334 -1.506919
H  1.10493 -2.189571 -0.011123
H  1.874669 -1.453167 1.419534
H  0.520881 0.078719 -0.905851
H  4.728903 0.165149 -0.564453
H  4.085338 -0.035746 1.083736
H  1.776961 1.151113 1.696457
H  0.96022 2.118899 0.430347
H  3.483206 2.236457 0.214134
H  2.733115 1.519226 -1.228502
H  4.828123 -2.414604 -0.778411
H  4.122296 -2.616366 0.851236
H  3.337961 -3.378722 -0.562516
H  -2.892373 1.189416 2.093936
H  -2.400692 -0.5360 2.274791
H  -5.481081 0.415527 -0.613416
H  -3.925194 1.350738 -0.700767
H  -5.070684 1.660055 0.619688
