program: Gaussian 09
title: 000249199
version: EM64L-G09RevD.01
frameworkgroup: C1[X(C10H16O2)]
method: RPBEPBE
basis: SDD
operation: Freq
keyword: #pfreq=noraman
keyword: PBEPBE/SDD
title: #p freq=noraman PBEPBE/SDD
converged: YES YES NO NO
title: Mulliken charges:
elementType: O O C C C C C C C C C C H H H H H H H H H H H H H H H H
charge: -0.259570 -0.245363 -0.337815 -0.350778 -0.480337 -0.688988 -0.467270 0.013279 -0.302514 -0.059612 0.294872 -0.755509 0.203193 0.193051 0.188909 0.223335 0.224406 0.232956 0.211717 0.204913 0.218148 0.243837 0.263605 0.244644 0.238265 0.253398 0.248485 0.246744
chargesum: 0.00000
title: Mulliken charges with hydrogens summed into heavy atoms:
elementType: O O C C C C C C C C C C
charge: -0.259570 -0.245363 0.058429 0.061465 -0.022976 -0.054210 0.040173 0.013279 0.180395 -0.059612 0.294872 -0.006883
polarizability: 1.59520972e+02 5.68304620e+00 1.02488198e+02 -6.39137038e+00 -3.06563843e+00 8.41575287e+01
1716.lowfreq: -30.7946 -6.6381 -0.0008 0.0004 0.0009 0.8762 6.9929 21.5584 25.2934
frequency: -30.7886 18.1480 24.6123 56.1818 61.3614 79.2227 86.8588 123.0706 154.0543 224.0932 233.4894 256.0829 280.6533 306.4832 321.7180 375.2500 412.4353 467.5950 537.0810 579.6415 619.1711 719.3047 754.0498 773.2597 802.9413 809.0328 878.3072 927.5358 951.6341 990.0037 1001.5527 1036.6212 1047.6884 1060.1157 1064.8054 1097.2206 1109.8665 1165.6930 1194.3914 1208.9312 1211.3857 1232.5762 1284.3207 1286.9002 1290.5850 1300.6122 1321.8213 1357.4096 1368.1418 1384.6946 1390.5216 1451.2769 1455.8141 1456.4850 1458.0894 1463.1114 1465.7335 1474.9689 1479.2184 1486.7477 1646.9361 2277.3440 2964.7008 2969.3674 2972.4610 2977.1017 2989.9339 3008.6988 3012.2339 3019.3755 3040.1605 3043.7306 3043.9411 3069.7426 3072.9394 3096.4607 3126.4677 3140.1035
redmass: 1.0809 4.1347 4.4023 2.7398 4.0191 2.2048 2.4073 3.8192 2.6564 3.2929 1.1124 2.3676 2.9172 3.0975 4.3275 3.8191 4.3027 4.8177 3.1947 3.3264 4.2453 1.8779 1.4724 1.9069 1.8812 1.8374 1.4437 1.3864 6.0143 2.6738 1.9212 4.0935 1.6938 2.3874 1.6842 1.5909 1.9800 2.6243 3.5388 1.2948 1.2789 1.3106 1.1381 1.1572 1.2687 1.2514 1.4459 1.5451 1.3104 1.2318 1.2133 1.0780 1.0861 1.0785 1.0477 1.0760 1.0880 1.0583 1.0426 1.0802 9.6732 11.7048 1.0587 1.0559 1.0419 1.0614 1.0585 1.0365 1.0980 1.0979 1.0646 1.1001 1.0977 1.1011 1.0992 1.0972 1.1090 1.1012
irintensity: 1.7054 1.1791 0.4527 1.5041 1.3279 0.7242 0.2452 0.3322 1.9500 3.7341 0.2385 1.3709 16.5089 11.9931 7.8337 0.4572 4.7050 11.7148 3.4012 5.1348 3.1458 5.4340 13.8604 7.4296 2.5032 0.0317 1.8173 8.8698 70.9616 1.1576 55.7835 18.8931 6.4604 1.3231 4.1675 2.8287 0.9205 0.3752 347.4812 13.6705 11.8148 0.3730 6.2764 0.5698 1.8072 0.2807 5.2332 4.1761 1.4162 54.8408 11.8254 5.2399 15.9304 14.8768 17.1813 1.9544 12.9867 3.1499 12.1866 14.4942 172.0007 1.0668 17.2614 29.8783 22.0507 79.5768 16.9235 3.2779 13.5905 15.1541 20.4216 32.7679 6.0326 93.8277 48.7765 7.0457 11.4682 9.1660
temp: 298.150 k
press: 1.00000 atm
elementType: 8 8 6 6 6 6 6 6 6 6 6 6 1 1 1 1 1 1 1 1 1 1 1 1 1 1 1 1
symmnumber: 1
zpe: 621473.6 jmol-1
zpe.correction: 0.236707 hartree
zpe.thermalcorrener: 0.251052 hartree
zpe.thermalcorrenthalpy: 0.251996 hartree
zpe.thermalcorrgfe: 0.192349 hartree
zpe.sumelectzpe: -540.109383 hartree
zpe.sumelectthermal: -540.095038 hartree
zpe.sumelectthermalent: -540.094094 hartree
zpe.sumelectthermalfe: -540.153741 hartree
dipole: 0.0762 -1.4557 0.3561
dipole: 1.5005
quadrupole: -57.4368 -78.3362 -71.8657
quadrupole: 0.0084 -1.9188 0.7796
quadrupole: 11.7761 -9.1233 -2.6528 0.0084 -1.9188 0.7796
hfenergy: -540.3460901 hartree
pointgroup: C01 [X(C10H16O2)]
dipole: -0.0047465 -0.5893113 0.0347496 debye
polarizability: 156.7170943|2.9412014|102.3241566|-16.7260711|0.3176629|87.1254474 unknown
InChI: InChI=1S/C10H16O2/c1-3-4-5-6-7-8-9-12-10(2)11/h3-5,8-9H2,1-2H3
charge 0 multiplicity 1
28 atoms
O  3.241722 -0.671164 -0.276482
O  3.142042 1.646672 -0.539421
C  -3.937944 0.180016 0.098179
C  -3.423221 1.312837 1.013027
C  -3.105124 -1.130375 0.203454
C  -4.269412 2.598612 0.895847
C  0.8694 -0.712587 -1.040201
C  -1.702089 -0.982344 -0.231505
C  1.821758 -0.673629 0.177925
C  -0.534197 -0.860711 -0.615688
C  3.787875 0.576219 -0.61045
C  5.230118 0.43374 -1.045466
H  -3.93718 0.526407 -0.953976
H  -4.989716 -0.056362 0.358701
H  -3.42394 0.960385 2.065061
H  -2.368701 1.532837 0.756725
H  -3.124026 -1.487096 1.253713
H  -3.588518 -1.922237 -0.40319
H  -4.25673 2.987776 -0.139799
H  -5.324757 2.40926 1.170196
H  -3.885742 3.395147 1.559293
H  1.163218 -1.553949 -1.696973
H  0.994817 0.220762 -1.620695
H  1.631655 0.223733 0.791314
H  1.731852 -1.58709 0.785022
H  5.55528 -0.615834 -1.016433
H  5.8722 1.041031 -0.384002
H  5.345962 0.832943 -2.068076
