program: Gaussian 09
title: 000249189
version: EM64L-G09RevD.01
frameworkgroup: C1[X(C9H9BrN6)]
method: RPBEPBE
basis: SDD
operation: Freq
keyword: #p
keyword: freq=noraman
keyword: PBEPBE/SDD
title: #p freq=noraman PBEPBE/SDD
converged: NO YES NO NO
title: Mulliken charges:
elementType: Br N N N N N N C C C C C C C C C H H H H H H H H H
charge: -0.006596 -0.421619 -0.166447 -0.163648 -0.137936 -0.588904 -0.587586 0.453624 -0.443536 -0.314752 0.104632 -0.155072 -0.173008 -0.236150 0.053840 0.086301 0.329140 0.230121 0.313346 0.248324 0.243827 0.333958 0.332642 0.330748 0.334751
chargesum: 0.00000
title: Mulliken charges with hydrogens summed into heavy atoms:
elementType: Br N N N N N N C C C C C C C C C
charge: -0.006596 -0.092479 -0.166447 -0.163648 -0.137936 0.077696 0.077913 0.453624 -0.213415 -0.001406 0.104632 0.093252 0.070819 -0.236150 0.053840 0.086301
polarizability: 3.06235524e+02 6.24906671e+00 1.62702139e+02 1.51095311e-01 -9.53961421e-02 5.92618914e+01
1716.lowfreq: -8.8077 -0.0006 -0.0005 0.0002 3.0384 4.2555 32.9118 45.8888 70.7727
frequency: 32.8426 45.6769 70.7712 107.3488 184.1075 185.7237 189.8131 192.4452 214.6464 301.9019 313.6185 324.0259 378.3150 413.3215 465.6303 468.7133 477.5231 508.2655 536.9174 540.3278 555.4375 585.5924 623.7411 647.0333 657.5388 704.5220 710.9541 721.5430 729.6458 795.2773 816.3571 824.0988 847.5943 901.2379 936.1470 942.6549 989.3515 990.9159 1015.7468 1061.4034 1104.3606 1123.8428 1131.0121 1184.9132 1242.9952 1283.7278 1294.2833 1338.4798 1388.4550 1404.2201 1441.7576 1475.2234 1491.9826 1503.7686 1532.5976 1549.0576 1590.8078 1597.9660 1607.1723 1636.4540 3123.3670 3161.5692 3171.0282 3185.8219 3523.2016 3559.7558 3561.4954 3720.7123 3721.0577
redmass: 7.2489 4.0163 7.6695 7.6585 6.4540 6.9625 7.6986 11.7878 5.9871 4.1993 3.1384 5.6155 6.0563 3.0306 1.1998 3.1159 1.2264 2.7278 1.0587 1.0425 8.1718 7.6043 7.0583 6.3371 1.6451 4.7006 5.7785 2.9386 6.0458 10.3023 1.4171 5.2738 1.3970 13.3263 2.1663 1.3581 5.0738 1.3105 3.3675 2.4280 1.7364 2.1390 2.3267 1.1079 2.5845 4.5076 1.3575 3.3343 5.2530 3.8162 4.1985 2.4061 2.6200 7.2851 2.7557 2.6457 3.7272 1.4720 5.7499 2.4954 1.0901 1.0904 1.0951 1.0957 1.0751 1.0440 1.0445 1.1059 1.1059
irintensity: 0.1104 0.3247 0.0172 0.7525 6.3358 1.1015 0.2027 0.5532 13.2018 9.2269 3.2440 0.0532 20.1867 0.1209 17.2237 4.4560 531.6527 59.0932 19.1620 2.0308 3.8864 3.0989 1.7827 8.5539 47.6501 0.7062 0.0420 14.2080 2.5788 46.0014 57.0948 16.4943 60.3510 0.4123 4.4563 1.8322 42.6846 3.5574 2.2088 25.1281 6.0176 4.0302 5.8653 5.8148 43.4938 0.4831 0.5326 8.1887 70.9896 88.8882 40.0715 423.5568 111.0557 1790.5425 239.4419 469.1101 137.9115 682.6776 59.7964 62.7559 14.3161 4.6481 4.6203 21.2333 33.8222 141.1304 88.3263 29.3090 65.9298
temp: 298.150 k
press: 1.00000 atm
elementType: 35 7 7 7 7 7 7 6 6 6 6 6 6 6 6 6 1 1 1 1 1 1 1 1 1
symmnumber: 1
zpe: 482452.8 jmol-1
zpe.correction: 0.183757 hartree
zpe.thermalcorrener: 0.197830 hartree
zpe.thermalcorrenthalpy: 0.198774 hartree
zpe.thermalcorrgfe: 0.141201 hartree
zpe.sumelectzpe: -689.242091 hartree
zpe.sumelectthermal: -689.228018 hartree
zpe.sumelectthermalent: -689.227074 hartree
zpe.sumelectthermalfe: -689.284647 hartree
dipole: -4.2385 -0.2866 0.0027
dipole: 4.2482
quadrupole: -91.1326 -79.6962 -108.5342
quadrupole: -1.1010 0.0822 0.0379
quadrupole: 1.9884 13.4248 -15.4132 -1.1010 0.0822 0.0379
hfenergy: -689.425848 hartree
pointgroup: C01 [X(C9H9Br1N6)]
dipole: 1.6614257 0.1820183 -0.0031552 debye
dipolederiv: -0.8519003 -0.1530106 0.0045467 -0.217172 -0.1214046 0.0026712 0.0079937 0.0030602 -0.0500407 -2.5400935 0.1537214 -0.0153739 0.4213695 -0.2954662 -0.0027998 -0.0278656 -0.0042987 -0.3519584 -2.2981211 -0.1586712 0.006078 -0.0938274 -0.6713419 0.0256156 0.0073442 0.0250595 -0.2513694 -1.3424145 0.4317372 -0.0270021 0.8567482 -1.1565846 0.0588229 -0.0516471 0.0566776 -0.2142228 -1.021255 -0.3554345 0.0205224 -0.1832578 -1.3620666 0.0666823 0.0117168 0.0671388 -0.2584884 -1.3987127 -0.6312427 0.0356711 -0.7580608 -0.6354802 -0.0058273 0.0395044 -0.0077859 -0.72261 -0.2880145 0.1196027 -0.0073472 0.3895343 -1.4907952 0.0467482 -0.0216903 0.0413129 -0.7134914 1.7436052 0.1074254 0.000245 0.619016 0.0333115 0.0068679 -0.0309403 0.0056893 0.1128461 -0.3728197 -0.0349889 0.0013433 0.1078407 0.0598341 -0.0130926 -0.0060714 -0.0140167 -0.207925 -0.3373696 0.0101196 -0.0007575 -0.2605003 -0.0548951 -0.0062132 0.014185 -0.0059948 -0.1618978 2.8086789 -0.153258 0.0128783 -0.9738101 1.1137814 -0.0577435 0.0525358 -0.0544656 0.2107482 -0.2102892 -0.098461 0.0045218 -0.1137991 0.0472034 -0.0067993 0.0048862 -0.0067576 -0.0823281 -0.2387065 -0.0456474 0.001437 -0.0452475 0.0798192 -0.0087768 0.0022248 -0.0086194 -0.0863672 1.2033174 0.3232657 -0.0108492 0.3723904 0.0190102 -0.0071339 -0.01396 -0.0073998 -0.1492246 2.3735693 0.5272195 -0.0283701 0.3674743 1.3732504 -0.069624 -0.0206665 -0.0683429 0.2144146 1.4052472 -0.0843 0.0059732 -0.5080078 2.0355433 -0.1105629 0.0297102 -0.1075215 0.2156666 0.1716389 0.0032596 -0.0005113 -0.0045558 0.1760503 0.0072657 0.0024147 0.0078144 0.3046059 0.0274857 -0.0959274 0.0043461 -0.0708755 -0.0837023 0.0124671 0.0034489 0.0125551 0.1688579 0.2348997 0.034548 -0.0012646 0.0349057 0.0437909 0.0063855 -0.0007239 0.0066334 0.1662316 0.0028634 0.0842778 -0.0047726 0.0873326 0.0268945 0.0069965 -0.0049178 0.0071012 0.1604785 0.0789302 -0.0340422 0.0013448 -0.0596406 -0.0486726 0.0102278 0.0025307 0.0103165 0.1545661 0.2926347 0.0444263 -0.0022503 0.009558 0.163691 0.0129895 0.0013282 0.0135289 0.387528 0.212966 0.0443832 -0.0026261 0.1066786 0.2306085 0.0097743 -0.0055825 0.0104361 0.3879015 0.1494187 0.0211929 -0.001012 -0.0332669 0.2660792 0.0068528 0.0024081 0.0081585 0.3792833 0.1944414 -0.0601953 0.0032293 -0.0508265 0.2515413 0.0082061 0.0018334 0.0097203 0.3867958 unknown
polarizability: 305.4670596|12.2063918|163.1516256|0.0555622|-5.7386442|59.5808694 unknown
InChI: InChI=1S/C9H9BrN6/c10-5-1-3-6(4-2-5)13-9-15-7(11)14-8(12)16-9/h1-4,13H,11-12H2
charge 0 multiplicity 1
25 atoms
Br -5.929091 -0.680435 0.005876
N  0.00896 1.112412 -0.06267
N  2.307868 1.290605 -0.0755
N  1.275291 -0.917384 0.056858
N  3.714882 -0.702364 0.043607
N  4.64406 1.442054 -0.083486
N  2.672686 -2.791169 0.167973
C  -1.32287 0.639176 -0.04218
C  -2.35797 1.614887 -0.094754
C  -1.672277 -0.737157 0.026141
C  1.223218 0.44489 -0.023836
C  -3.713709 1.233122 -0.081201
C  -3.030142 -1.119803 0.039558
C  -4.038185 -0.137226 -0.014118
C  3.521702 0.656397 -0.039075
C  2.555629 -1.428184 0.088299
H  0.140571 2.126222 -0.120232
H  -2.104543 2.680944 -0.147153
H  -0.873612 -1.479406 0.068214
H  -4.499606 1.992158 -0.122431
H  -3.293987 -2.180167 0.091926
H  5.557618 0.997506 -0.059454
H  4.54163 2.451127 -0.144956
H  1.832911 -3.361958 0.20469
H  3.600766 -3.204446 0.195504
