program: Gaussian 09
title: 000249173
version: EM64L-G09RevD.01
frameworkgroup: C1[X(C23H21N7O6)]
method: RPBEPBE
basis: SDD
operation: Freq
keyword: #p
keyword: freq=noraman
keyword: PBEPBE/SDD
title: #p freq=noraman PBEPBE/SDD
converged: YES YES NO NO
title: Mulliken charges:
elementType: O O O O O O N N N N N N N C C C C C C C C C C C C C C C C C C C C C C C H H H H H H H H H H H H H H H H H H H H H
charge: -0.199376 -0.201767 -0.206783 -0.204583 -0.205058 -0.209275 -0.101579 -0.120901 -0.040110 -0.004207 0.019597 0.019638 0.020388 -0.165012 0.445304 -0.511859 -0.336912 -0.595032 -0.642347 0.367052 -0.204099 -0.379640 -0.317325 -0.392922 0.454350 0.484704 -0.507348 -0.521057 -0.419639 -0.357459 0.380362 0.380978 -0.198562 -0.194585 -0.376962 -0.370852 0.212520 0.302541 0.272888 0.212747 0.232412 0.265497 0.246328 0.228257 0.250546 0.246009 0.292652 0.255371 0.228887 0.316454 0.279770 0.239541 0.272502 0.240225 0.241431 0.288491 0.287809
chargesum: 0.00000
title: Mulliken charges with hydrogens summed into heavy atoms:
elementType: O O O O O O N N N N N N N C C C C C C C C C C C C C C C C C C C C C C C
charge: -0.199376 -0.201767 -0.206783 -0.204583 -0.205058 -0.209275 -0.101579 -0.120901 -0.040110 -0.004207 0.019597 0.019638 0.020388 0.047508 0.445304 -0.209318 -0.064023 0.115624 0.082784 0.367052 0.041911 -0.086989 -0.061954 -0.164036 0.454350 0.484704 -0.190894 -0.241288 -0.180098 -0.084957 0.380362 0.380978 0.041663 0.046846 -0.088471 -0.083043
polarizability: 4.12542305e+02 -6.88381491e+00 3.73088989e+02 6.72142251e+00 5.66522905e+01 3.22817591e+02
1716.lowfreq: -6.2433 -4.0683 -1.2568 -0.0005 -0.0004 -0.0002 7.4327 10.6854 14.3402
frequency: 6.7327 10.6821 14.3272 20.4483 27.1863 36.4570 47.6030 51.2781 52.2774 56.6571 58.7001 78.3973 81.2363 90.4524 107.5216 126.6730 135.3375 150.0131 162.0703 169.5614 174.6172 187.8782 195.0134 229.0358 235.3204 242.3629 255.1953 265.0238 289.7710 302.9110 314.4366 323.2665 338.3691 352.5164 368.1426 380.9918 392.6940 413.7866 425.3153 426.5242 428.0011 433.0198 437.5158 493.5984 504.2355 519.5287 526.6880 536.8339 538.1580 558.0564 585.7630 620.3830 636.1446 652.3658 663.2358 670.6955 677.1127 686.9059 688.9591 694.8388 702.5905 704.4097 705.5504 769.0427 781.3267 782.4123 813.8479 816.7795 822.7696 866.3023 872.2736 877.6776 898.7384 909.7575 916.6496 936.6332 939.2897 945.9576 951.0072 952.2417 961.8261 962.7356 984.5089 985.9114 989.6847 990.5891 997.4002 1006.2831 1006.7498 1019.0454 1074.1222 1082.1369 1085.8404 1086.4514 1087.6808 1089.5775 1097.1791 1108.7325 1146.8262 1161.4461 1171.6021 1175.8995 1176.1502 1191.7939 1194.8730 1211.7461 1214.6639 1218.3674 1231.4267 1239.7565 1256.4561 1277.1349 1282.5169 1301.8050 1305.2257 1355.7648 1358.0420 1372.6924 1373.3671 1373.7172 1383.0667 1396.3440 1398.2793 1406.7333 1424.3647 1431.3214 1432.2161 1437.5624 1445.0988 1456.2535 1462.8372 1473.7590 1478.1663 1480.7865 1489.5529 1492.3619 1553.9960 1560.5013 1583.3507 1585.9911 1590.4087 1613.4772 1615.5503 1616.1845 2947.3894 2959.6671 2999.0931 3016.1328 3046.5447 3048.6955 3093.3612 3107.8112 3126.2501 3126.5721 3144.7118 3148.9952 3157.1216 3162.6196 3164.1311 3175.8756 3187.7187 3188.0316 3189.6331 3189.7254 3190.5999
redmass: 5.3748 8.9828 8.5504 9.5642 6.5339 6.7598 4.7040 8.0970 11.4756 5.3674 9.1878 3.9007 5.5760 4.5920 5.4782 5.3175 1.3798 2.8854 4.9450 5.0690 3.9670 4.1963 1.5278 6.1536 5.6155 4.5699 5.3124 6.3978 3.8698 3.0855 2.6690 4.4087 5.3770 5.2832 7.3356 8.3999 7.1266 5.7974 3.4642 3.2897 3.4029 5.6546 6.3689 5.1370 6.8900 6.6214 6.0571 4.9258 5.0196 4.9986 4.6484 5.9458 6.3629 7.0683 7.4339 5.2260 6.4362 2.2182 2.2459 3.8822 4.2086 5.8048 5.5453 8.8588 7.8951 6.8512 1.5189 1.6604 1.4629 3.1060 6.0915 1.4555 1.5489 3.4243 4.0302 1.9156 1.6808 2.1410 1.7375 1.4039 1.3970 1.4681 5.3272 5.7514 5.9336 2.9633 1.3597 1.3755 1.3629 2.0695 1.7703 1.7692 1.5837 1.8923 1.6570 1.6758 1.2981 1.4166 2.8782 3.2422 1.1421 1.1561 1.1411 3.2065 2.1639 5.3742 6.2765 7.0765 3.8136 2.3543 1.8451 1.3419 1.3370 1.4776 1.5388 1.9070 1.7355 9.8192 10.5528 9.9070 3.3619 5.5038 3.1437 2.0878 1.3198 2.7047 3.0461 2.5069 1.4425 1.0468 1.0710 2.6705 2.4942 2.7641 1.1228 1.1378 5.8971 6.4729 6.0389 6.2200 6.9496 7.0229 7.0567 6.9851 1.0372 1.0412 1.0823 1.1009 1.0958 1.0867 1.0882 1.0960 1.0891 1.0978 1.0885 1.0885 1.0933 1.0917 1.0940 1.0933 1.0941 1.0918 1.0938 1.0964 1.0957
irintensity: 0.3839 0.8882 0.3711 2.4276 2.0639 0.3786 5.0609 1.3646 0.2019 0.4271 0.0740 1.9910 5.1357 0.6874 0.3009 1.1962 0.9815 1.4190 0.2422 1.0945 0.5914 1.0720 0.9859 3.2201 2.4921 0.8096 2.0994 11.7960 2.0641 5.4274 5.2130 0.4587 0.8185 2.0414 0.7394 0.8544 2.3023 0.7773 2.2280 0.1841 0.5204 9.1762 3.1299 3.3556 1.6035 1.0750 1.4480 1.9414 10.6665 41.0118 21.5432 10.1807 2.9564 11.1032 40.0032 0.4146 18.0644 39.8607 13.6473 0.3809 50.4275 17.0116 15.8263 18.4381 23.2676 24.1974 33.8442 41.7420 17.8532 13.1773 40.2251 14.5190 17.7733 19.1596 3.8253 10.3663 40.3551 13.4410 18.6487 12.7341 9.8014 27.2192 38.5630 1.7743 2.0114 204.9325 4.6268 0.9838 2.3751 115.8032 40.5642 7.0310 2.0641 45.1664 9.5505 28.9035 0.3196 22.9158 65.0829 85.9256 6.0209 23.1161 18.2320 65.0058 52.4912 357.1467 201.4850 118.7405 214.5203 56.3954 20.1692 0.6591 1.2363 2.2075 10.2653 11.8276 17.7660 110.8899 85.5665 148.9030 13.1765 18.7572 18.9418 44.1057 12.2252 3.4983 42.6447 26.4700 0.3775 11.5367 12.0595 35.7093 27.4907 40.4850 4.1632 47.0923 86.6839 137.3072 5.1369 75.0331 5.0451 5.2358 6.7978 2.4244 47.9297 94.6095 21.2637 26.3599 38.3244 33.0093 28.6086 12.6061 12.9381 7.9989 2.0124 7.5036 12.9164 3.6164 8.3915 2.7157 0.6849 2.8208 3.9822 4.9778 6.3391
temp: 298.150 k
press: 1.00000 atm
elementType: 8 8 8 8 8 8 7 7 7 7 7 7 7 6 6 6 6 6 6 6 6 6 6 6 6 6 6 6 6 6 6 6 6 6 6 6 1 1 1 1 1 1 1 1 1 1 1 1 1 1 1 1 1 1 1 1 1
symmnumber: 1
zpe: 1097577.6 jmol-1
zpe.correction: 0.418045 hartree
zpe.thermalcorrener: 0.451122 hartree
zpe.thermalcorrenthalpy: 0.452066 hartree
zpe.thermalcorrgfe: 0.346523 hartree
zpe.sumelectzpe: -1720.759780 hartree
zpe.sumelectthermal: -1720.726704 hartree
zpe.sumelectthermalent: -1720.725760 hartree
zpe.sumelectthermalfe: -1720.831303 hartree
dipole: 2.8624 6.8836 4.4712
dipole: 8.6931
quadrupole: -282.6176 -233.3012 -191.4712
quadrupole: 16.6142 -20.5321 31.8907
quadrupole: -46.8209 2.4955 44.3254 16.6142 -20.5321 31.8907
hfenergy: -1721.1778256 hartree
pointgroup: C01[X(C23H21N7O6)]
dipole: -3.0756529 1.3977294 -0.5329044 debye
polarizability: 391.3696441|-20.9509948|386.100432|37.9130094|48.2620055|330.9788088 unknown
InChI: InChI=1S/C23H21N7O6/c1-26(24-15-17-6-3-9-20(12-17)28(31)32)23(19-8-5-11-22(14-19)30(35)36)27(2)25-16-18-7-4-10-21(13-18)29(33)34/h3-16,23H,1-2H3
charge 0 multiplicity 1
57 atoms
O  -3.299461 -0.018898 5.04818
O  -1.88732 1.66123 4.428801
O  0.660045 -5.304447 -4.882598
O  7.019419 2.02466 1.771346
O  -0.45195 -3.430136 -5.548155
O  5.808127 3.951012 1.90837
N  -2.127524 1.368255 -2.000135
N  -1.139531 2.879329 -0.265995
N  -1.495281 0.170504 -2.237622
N  0.022676 2.179464 -0.073406
N  -2.746452 0.735726 4.15967
N  0.120763 -4.154891 -4.646851
N  5.927407 2.696706 1.622874
C  -2.298841 2.065625 -0.695532
C  -2.859326 1.139604 0.400744
C  -2.502653 1.32283 1.751523
C  -3.838523 0.168277 0.066236
C  -2.291364 2.19318 -3.212569
C  -1.210413 4.347799 -0.171179
C  -3.125651 0.528218 2.736217
C  -4.446861 -0.61808 1.068536
C  -4.095055 -0.447086 2.423935
C  -0.954794 -0.578331 -1.29322
C  1.142373 2.803459 0.257039
C  -0.380973 -1.884248 -1.650876
C  2.389038 2.043737 0.425193
C  -0.41397 -2.386719 -2.980588
C  3.536552 2.70671 0.931664
C  0.233671 -2.675384 -0.637454
C  2.493453 0.662798 0.080429
C  0.163075 -3.638358 -3.251322
C  4.736184 1.985255 1.090657
C  0.804983 -3.931454 -0.938093
C  3.705326 -0.034724 0.249794
C  0.778781 -4.432905 -2.255212
C  4.849339 0.617574 0.76179
H  -3.093939 2.809318 -0.899813
H  -1.75382 2.05869 2.052772
H  -4.11117 0.026885 -0.985203
H  -3.231608 2.77147 -3.157383
H  -1.445796 2.896436 -3.355162
H  -2.329576 1.516729 -4.078643
H  -0.513884 4.832973 -0.885559
H  -2.235083 4.678946 -0.40027
H  -0.95673 4.69798 0.849594
H  -5.194655 -1.367871 0.792183
H  -4.54675 -1.038846 3.224102
H  -0.876837 -0.268974 -0.24258
H  1.202853 3.891794 0.421392
H  -0.881772 -1.8051 -3.778123
H  3.513133 3.765762 1.20701
H  0.255332 -2.301964 0.393925
H  1.616482 0.160388 -0.337131
H  1.268658 -4.523102 -0.142184
H  3.765169 -1.092145 -0.028166
H  1.208974 -5.401074 -2.522064
H  5.803251 0.103014 0.900615
