program: Gaussian 09
title: 000249155
version: EM64L-G09RevD.01
frameworkgroup: C1[X(C9H12O4S)]
method: RPBEPBE
basis: SDD
operation: Freq
keyword: #p
keyword: freq=noraman
keyword: PBEPBE/SDD
title: #p freq=noraman PBEPBE/SDD
converged: YES YES NO NO
title: Mulliken charges:
elementType: S O O O O C C C C C C C C C H H H H H H H H H H H H
charge: 0.992563 -0.434191 -0.501531 -0.510442 -0.440750 -0.041602 0.453262 -0.243098 -0.233679 -0.359924 -0.356575 -0.250027 -0.303505 -0.796851 0.286504 0.282653 0.248020 0.247432 0.243112 0.227218 0.207064 0.220292 0.232879 0.232712 0.245739 0.352726
chargesum: 0.00000
title: Mulliken charges with hydrogens summed into heavy atoms:
elementType: S O O O O C C C C C C C C C
charge: 0.992563 -0.434191 -0.501531 -0.510442 -0.088024 -0.041602 0.453262 0.043405 0.048975 -0.111904 -0.109143 0.220304 0.123851 -0.085522
polarizability: 1.88570408e+02 -1.68632011e+01 1.06319957e+02 -9.83520960e-01 4.75779740e+00 1.26680814e+02
1716.lowfreq: -10.9746 -0.0014 0.0005 0.0007 2.3491 5.1852 19.2227 27.8299 37.8610
frequency: 17.2524 27.5573 37.6502 43.9539 45.1550 105.7053 128.1490 133.6895 187.0836 229.1299 232.1569 258.2163 303.7484 317.8070 368.4020 386.1593 407.6053 417.7738 433.1474 471.6482 508.3997 585.1060 594.5180 620.4990 705.2919 777.3628 820.0822 827.6188 833.9156 848.8045 867.5872 958.9581 964.0726 969.0372 984.9464 992.5649 993.5660 1031.9303 1050.0838 1054.0477 1086.0423 1120.3461 1182.8119 1185.8843 1200.7873 1219.1093 1298.1481 1330.3642 1342.1741 1378.1261 1382.4518 1393.3247 1401.7151 1455.5909 1462.6404 1470.9840 1472.3067 1475.0925 1594.2647 1595.0555 2975.5708 2981.9748 2992.3163 3064.7977 3067.8705 3078.6701 3094.6711 3139.5869 3141.0994 3164.8237 3167.7725 3558.3592
redmass: 4.6565 4.4062 1.0273 3.5817 5.9956 4.5398 6.7758 4.9428 5.2371 6.9998 4.2808 3.5297 5.1971 4.3422 4.3787 4.0097 2.8441 1.3900 4.0379 4.2214 3.2760 4.6035 6.2981 6.9601 3.3409 4.8104 2.6193 1.6421 5.1678 1.2444 2.6452 11.0557 1.3777 2.1302 1.3821 1.7199 3.4527 3.4167 1.6021 2.4721 1.8166 1.2861 1.1661 1.1372 1.1755 3.0672 1.2620 1.1983 1.2744 1.2300 6.0907 2.9892 1.2180 1.0822 1.0836 1.1028 2.3335 1.0634 6.0097 6.9053 1.0663 1.0392 1.0551 1.0946 1.1069 1.0991 1.1002 1.0893 1.0895 1.0958 1.0971 1.0657
irintensity: 0.6250 1.7561 0.5570 1.2402 0.6065 2.8974 1.5206 9.5079 6.8830 5.4216 1.0497 6.2716 10.2368 4.9923 0.3892 2.1061 1.1503 178.4905 27.7252 88.5851 53.4452 67.0755 59.7721 0.1761 1.5406 4.3340 45.0078 97.3644 41.5546 0.3259 20.2186 89.6890 9.2075 58.7754 0.0812 4.2745 3.1273 69.0922 22.4998 23.8907 12.1605 7.1287 13.8696 9.7483 25.2331 6.4030 2.5401 13.9428 0.7103 41.6059 0.5516 11.5473 17.8032 5.9086 27.9703 17.7743 20.0976 13.8970 16.1066 0.4198 52.2511 19.5705 38.7535 18.3375 20.6369 29.3483 13.8451 12.2394 5.2764 0.4470 8.9466 6.7264
temp: 298.150 k
press: 1.00000 atm
elementType: 16 8 8 8 8 6 6 6 6 6 6 6 6 6 1 1 1 1 1 1 1 1 1 1 1 1
symmnumber: 1
zpe: 514484.6 jmol-1
zpe.correction: 0.195957 hartree
zpe.thermalcorrener: 0.211673 hartree
zpe.thermalcorrenthalpy: 0.212617 hartree
zpe.thermalcorrgfe: 0.149452 hartree
zpe.sumelectzpe: -1047.855176 hartree
zpe.sumelectthermal: -1047.839460 hartree
zpe.sumelectthermalent: -1047.838516 hartree
zpe.sumelectthermalfe: -1047.901681 hartree
dipole: -5.2863 2.4637 -1.7340
dipole: 6.0845
quadrupole: -76.6387 -105.0885 -88.1107
quadrupole: -8.2825 -6.3412 0.1241
quadrupole: 13.3073 -15.1425 1.8353 -8.2825 -6.3412 0.1241
hfenergy: -1048.0511332 hartree
pointgroup: C01 [X(C9H12O4S1)]
dipole: -2.0608685 1.2168549 0.0503783 debye
dipolederiv: 2.1221888 -0.0444722 -0.0979111 0.2565802 1.5541027 0.1032393 0.0056501 0.1440419 1.1939005 -1.1505261 -0.1675692 0.0466994 -0.2932442 -0.659252 -0.0630248 -0.0541879 -0.1096336 -0.4637487 -0.6845803 0.0782642 0.0146676 -0.0314168 -0.6543285 0.0322903 0.0350662 0.1355368 -0.4983895 -0.6954401 0.0356382 0.0475928 -0.0161276 -0.5035711 -0.0246949 -0.0176586 -0.1430689 -0.6416371 -0.1865966 0.0372697 0.05693 -0.0663658 -0.6429718 -0.0680833 -0.0983116 -0.1209279 -0.7434615 -0.0790094 -0.0152064 -0.0083689 0.0225973 -0.2146371 -0.0444317 0.0098362 -0.0446282 -0.1196474 0.4407377 -0.1970857 -0.1073588 -0.2734991 0.109762 0.0521335 -0.1353431 0.0458156 0.0538065 -0.1170441 -0.0522668 0.0818279 0.0936528 -0.0692666 -0.0861058 -0.2323601 0.0617123 -0.011054 -0.0996023 0.0104026 -0.0868624 -0.087901 -0.0532652 0.0495311 0.2360803 -0.0925357 -0.042729 -0.2447934 0.0707562 -0.0859428 0.0879221 -0.1666615 -0.0361157 -0.0851543 -0.0336182 0.0831057 -0.2131624 -0.032591 0.1391429 -0.0183532 -0.0773434 -0.1189238 0.1475286 -0.1167748 -0.0349478 0.750241 0.1160383 -0.0499575 -0.3817015 -0.0467262 -0.1103952 -0.2348541 -0.1399621 0.1803115 0.0794665 -0.104876 -0.0490318 0.2330173 0.4850742 0.0637122 0.1805927 0.0826532 0.6588824 -0.1136072 0.0811383 0.0447172 0.2144728 -0.0395843 -0.0606819 0.0923914 -0.049399 0.0489012 0.123173 0.0483375 -0.0464312 0.0302879 0.1137267 0.0503958 -0.0376995 0.0249581 0.100593 0.1291694 0.0034395 0.0605621 -0.0075338 0.1427537 -0.000725 0.0416784 0.0215726 0.0534085 0.0219589 0.0199279 0.0912298 0.0318253 0.1302384 0.0317867 0.0882872 0.0342762 -0.0371122 0.0043755 0.0834796 -0.0529157 0.090524 0.0867619 0.0728301 -0.0431876 0.0720022 0.0227502 -0.0731293 -0.0172265 -0.0084252 0.1115144 -0.0351059 0.053587 -0.015858 0.098312 0.0456119 -0.0143282 -0.0439254 -0.0328362 0.0341719 0.0841996 -0.0382406 0.0946475 -0.0083982 -0.1169197 0.059509 0.1258145 -0.0818579 0.0551941 -0.0847761 0.0792196 -0.0456719 0.0722021 -0.0901949 -0.1474352 -0.0338563 0.077812 -0.0737445 0.0603227 -0.0215245 -0.0162731 -0.0349806 0.0318612 -0.0162866 0.0274083 -0.0441281 -0.0000136 0.1173576 0.006158 -0.136759 0.012162 -0.0597821 0.0093418 -0.0013711 0.046679 -0.0845517 0.0391598 0.1052236 0.098624 0.0893931 -0.0061768 0.0234338 -0.0091133 0.0036377 0.026867 -0.084888 -0.0819307 0.0191135 -0.0789068 0.086497 0.0719458 -0.0183551 0.0405293 0.0458258 0.4089186 0.0547707 0.1038226 0.0781958 0.306171 unknown
polarizability: 186.8094122|-15.4325162|108.2285765|-13.3254724|-6.0585738|126.5331898 unknown
InChI: InChI=1S/C9H12O4S/c1-8-2-4-9(5-3-8)14(11,12)13-7-6-10/h2-5,10H,6-7H2,1H3
charge 0 multiplicity 1
26 atoms
S  0.984049 -1.263812 -0.579381
O  1.993373 0.245535 -0.112978
O  1.334357 -2.466828 0.446544
O  1.148702 -1.472734 -2.178767
O  4.012036 1.571208 1.445982
C  -0.691003 -0.538526 -0.176402
C  -3.216106 0.505727 0.414575
C  -1.217362 -0.766998 1.104615
C  -1.360823 0.17858 -1.180156
C  -2.494555 -0.236218 1.387681
C  -2.636244 0.696611 -0.868764
C  3.427588 0.12109 -0.486532
C  4.049939 1.439847 -0.009973
C  -4.573909 1.096013 0.744021
H  -0.660759 -1.355357 1.840846
H  -0.912629 0.307164 -2.170249
H  -2.93566 -0.402942 2.376719
H  -3.187718 1.255628 -1.633004
H  3.879912 -0.738926 0.04168
H  3.526748 0.001722 -1.58255
H  3.536874 2.288619 -0.507924
H  5.118906 1.456456 -0.282915
H  -5.219956 1.153877 -0.148876
H  -5.099816 0.502894 1.511722
H  -4.467443 2.124822 1.139253
H  3.073099 1.43665 1.735031
