program: Gaussian 09
title: 000249154
version: EM64L-G09RevD.01
frameworkgroup: C1[X(C6H5Cl3NOP)]
method: RPBEPBE
basis: SDD
operation: Freq
keyword: #p
keyword: freq=noraman
keyword: PBEPBE/SDD
title: #p freq=noraman PBEPBE/SDD
converged: NO NO NO NO
title: Mulliken charges:
elementType: Cl Cl Cl P O N C C C C C C H H H H H
charge: -0.133107 -0.133470 -0.045467 0.875233 -0.514331 -0.819245 0.591306 -0.395674 -0.361020 -0.181425 -0.190994 -0.117701 0.372953 0.231458 0.298758 0.261038 0.261689
chargesum: 0.00000
title: Mulliken charges with hydrogens summed into heavy atoms:
elementType: Cl Cl Cl P O N C C C C C C
charge: -0.133107 -0.133470 -0.045467 0.875233 -0.514331 -0.446293 0.591306 -0.164216 -0.062262 0.079613 0.070695 -0.117701
polarizability: 2.16704518e+02 -1.02230750e+00 8.98161214e+01 9.04326032e+00 -2.35300397e+00 1.08906818e+02
1716.lowfreq: -52.2146 -3.1356 -0.0030 -0.0026 -0.0016 5.2531 10.8049 32.3181 89.4394
frequency: -52.1736 31.9222 89.4318 97.8141 107.6324 124.9940 183.0624 216.5996 219.6458 268.7680 296.7680 333.9172 369.0456 406.4278 425.5858 493.5466 497.6142 589.0479 617.0206 646.3985 704.9786 762.3158 809.2666 834.4810 896.6407 938.5380 964.7803 992.8038 1050.8302 1079.4576 1122.0820 1195.2904 1236.1229 1299.2707 1341.2789 1398.1174 1447.9742 1477.2304 1592.0747 1601.2428 3134.0102 3158.7921 3175.1409 3179.5669 3524.6844
redmass: 6.5464 4.7306 6.8125 12.9450 13.2421 23.3686 20.5537 11.8778 20.5500 13.1043 5.8189 6.1664 16.5655 3.1660 7.5170 2.5928 11.5600 1.4776 7.1589 7.2881 3.3071 6.9536 1.3329 1.4695 5.6723 1.3696 1.3481 4.2846 15.8995 2.5901 1.3428 1.1282 2.7660 1.3129 2.7351 3.9304 1.7014 2.3946 6.5144 6.1843 1.0902 1.0901 1.0955 1.0970 1.0758
irintensity: 4.6851 0.0298 1.9263 3.1618 0.8807 3.1999 2.3073 3.6406 1.1779 2.3410 2.0120 4.3296 92.8494 6.6240 78.8758 78.5157 64.9058 97.6370 0.3505 45.9634 0.1398 45.8737 28.3897 75.5500 120.6939 1.1631 0.8993 47.4617 77.2532 31.4965 18.1655 4.1606 102.9587 15.7719 97.7819 13.9404 43.4279 241.8976 1.4161 13.7545 8.6882 1.4752 1.8901 0.5269 45.3643
temp: 298.150 k
press: 1.00000 atm
elementType: 17 17 17 15 8 7 6 6 6 6 6 6 1 1 1 1 1
symmnumber: 1
zpe: 268754.3 jmol-1
zpe.correction: 0.102363 hartree
zpe.thermalcorrener: 0.114411 hartree
zpe.thermalcorrenthalpy: 0.115355 hartree
zpe.thermalcorrgfe: 0.061921 hartree
zpe.sumelectzpe: -2082.149598 hartree
zpe.sumelectthermal: -2082.137550 hartree
zpe.sumelectthermalent: -2082.136606 hartree
zpe.sumelectthermalfe: -2082.190040 hartree
dipole: 1.1749 0.4077 -3.2179
dipole: 3.4498
quadrupole: -113.8602 -103.4884 -92.4693
quadrupole: -0.3897 2.9585 -1.3840
quadrupole: -10.5876 -0.2158 10.8033 -0.3897 2.9585 -1.3840
hfenergy: -2082.2519609 hartree
pointgroup: C01 [X(C6H5Cl3N1O1P1)]
dipole: 0.5608475 -1.1973253 0.3066817 debye
dipolederiv: -0.6789004 -0.1440804 -0.249205 -0.3496769 -0.4022735 -0.2870292 -0.3179519 -0.179263 -0.5230143 -0.6263391 0.0208487 0.2809542 -0.1053713 -0.2239717 0.1050043 0.4657335 -0.021763 -0.7772978 -0.9142891 -0.1274259 0.0785992 -0.1503838 -0.136408 0.0281568 0.0846027 0.0268451 -0.0757561 2.8093746 0.1161315 -0.0779038 -0.2891873 1.2889138 0.1983874 0.0347709 0.1782689 1.8783972 -0.667806 -0.0520065 0.0237135 0.1022043 -0.5503581 0.0090704 -0.0254183 0.0179668 -0.5028493 -1.9599105 -0.0938526 0.1011334 0.2819632 -0.4344631 -0.0149878 -0.0276241 0.0055325 -0.4287155 1.3971951 0.1156001 -0.0974556 0.5963673 0.0369781 -0.0263329 -0.2298002 -0.0030045 0.0597929 -0.2925021 -0.0317769 0.0122408 -0.0209727 0.0553696 -0.0769315 0.0175662 -0.07651 -0.1987805 -0.1381432 0.0066324 -0.0033615 -0.232373 -0.0742491 -0.0137766 0.0635702 -0.0248282 -0.155899 -0.1953188 -0.0449354 0.0195981 -0.0776696 0.0218112 -0.019607 0.0268955 -0.0218886 -0.0568806 -0.264591 -0.0417836 0.0225477 0.0739653 0.0746102 -0.0447277 -0.0138201 -0.0387186 -0.0554041 1.2287632 0.2173708 -0.1264336 0.2075025 0.0476749 -0.0483751 -0.1227129 -0.0487527 -0.0671568 0.0769977 0.0554207 -0.0036949 -0.0355971 0.1931147 0.0343682 0.0222701 0.0294915 0.2969442 0.0397532 -0.0912164 0.0318766 -0.0733167 -0.03473 0.0597427 0.0273063 0.0605612 0.1426589 0.0936345 0.0629425 -0.0151242 0.0640369 0.0906994 0.0167964 -0.013466 0.0172805 0.1579234 0.0157386 0.0677232 -0.0118819 0.0529388 0.0430055 0.0332278 -0.0090493 0.0323707 0.1593653 0.0763435 -0.0355921 0.0143969 -0.0444298 0.0042761 0.0470137 0.0171274 0.0464113 0.1466723 unknown
polarizability: 214.2899766|15.0883295|109.2307873|-10.7151349|-6.3976791|91.9066939 unknown
InChI: InChI=1S/C6H5ClNOP.2Cl/c7-5-1-3-6(4-2-5)8-10-9;;/h1-4,8H;;
charge 0 multiplicity 1
17 atoms
Cl -3.940292 -1.041163 -1.320685
Cl -3.754568 -0.093627 1.981552
Cl 4.662042 0.47578 -0.402512
P  -2.630373 0.213772 0.03738
O  -2.398153 1.716475 -0.406828
N  -1.235947 -0.762494 0.235975
C  0.143169 -0.411247 0.069304
C  1.099315 -1.432025 0.31511
C  0.571069 0.882776 -0.321405
C  2.476124 -1.165316 0.171665
C  1.949934 1.147059 -0.464047
C  2.884159 0.124451 -0.216936
H  -1.420909 -1.729946 0.518352
H  0.775844 -2.434757 0.617876
H  -0.152558 1.679854 -0.513914
H  3.213238 -1.950452 0.360611
H  2.286108 2.142962 -0.765096
