program: Gaussian 09
title: 000249153
version: EM64L-G09RevD.01
frameworkgroup: C1[X(C23H24Cl2N3OP)]
method: RPBEPBE
basis: SDD
operation: Freq
keyword: #p
keyword: freq=noraman
keyword: PBEPBE/SDD
title: #p freq=noraman PBEPBE/SDD
converged: NO YES NO NO
title: Mulliken charges:
elementType: Cl Cl P O N N N C C C C C C C C C C C C C C C C C C C C C C C H H H H H H H H H H H H H H H H H H H H H H H H
charge: -0.060177 -0.059758 1.344075 -0.615336 -0.477793 -0.520136 -0.836152 -0.352717 -0.384610 -0.358799 -0.562209 -0.495816 0.521890 0.520167 0.528382 -0.347660 -0.450567 -0.424139 -0.348114 -0.420938 -0.309594 -0.219082 -0.200443 -0.212400 -0.210534 -0.196582 -0.227566 -0.109142 -0.108774 -0.262095 0.234761 0.233007 0.224004 0.245546 0.206014 0.225649 0.258631 0.230325 0.273193 0.216609 0.338444 0.270506 0.240619 0.238771 0.247344 0.224763 0.245027 0.257666 0.255592 0.254830 0.254851 0.224851 0.226777 0.228838
chargesum: 0.00000
title: Mulliken charges with hydrogens summed into heavy atoms:
elementType: Cl Cl P O N N N C C C C C C C C C C C C C C C C C C C C C C C
charge: -0.060177 -0.059758 1.344075 -0.615336 -0.477793 -0.520136 -0.497709 0.115051 0.084940 0.072864 -0.073253 -0.006014 0.521890 0.520167 0.528382 -0.077154 -0.209947 -0.185368 -0.100770 -0.196175 -0.064567 0.038584 0.055149 0.042431 0.044317 0.028269 -0.000789 -0.109142 -0.108774 -0.033257
polarizability: 3.57043417e+02 -1.32142994e+01 3.86296254e+02 8.57350721e-01 2.06097484e+00 1.93970896e+02
1716.lowfreq: -7.7066 -4.2152 -3.6613 0.0013 0.0019 0.0021 7.6975 10.5215 16.0551
frequency: 7.2044 9.2518 15.9278 18.9071 23.6567 29.6524 35.4717 49.1272 59.2704 77.0563 86.7895 113.1967 126.8719 141.7254 163.1726 166.0318 173.9393 211.1042 243.7254 259.8122 264.4819 275.2187 284.5339 300.8548 312.1391 337.5926 356.6613 369.3980 380.2840 381.3797 404.8398 409.2442 409.7208 421.1519 430.8748 437.0029 457.7737 486.8900 492.8235 510.7075 520.8934 539.4260 586.2623 610.0334 620.8739 624.6805 626.8117 639.9394 648.7935 681.8425 693.7321 720.0657 728.7930 753.0478 776.6675 789.8126 793.4955 821.8003 826.0826 828.7633 831.4250 834.6653 842.7094 850.0006 870.4235 887.2455 893.6020 908.0010 946.1746 953.8456 960.8906 967.8725 973.9015 981.7141 985.9453 986.0390 999.2017 1001.0280 1019.0233 1022.4715 1025.4672 1035.2250 1044.6669 1070.0213 1070.7323 1084.9720 1098.7511 1108.5024 1110.7489 1125.4626 1163.2931 1170.5282 1178.1482 1184.3094 1187.8313 1205.5809 1206.7593 1210.2005 1238.6460 1245.3524 1262.3455 1284.7914 1293.9796 1304.5475 1308.1110 1309.0712 1336.9751 1340.1929 1347.8552 1353.5461 1355.3814 1357.2647 1381.4576 1384.1009 1395.7091 1398.1708 1399.0797 1438.5507 1455.5179 1457.0733 1458.1555 1468.2021 1471.2716 1476.3339 1480.0238 1487.8059 1587.3361 1589.5957 1593.1120 1597.6661 1600.5710 1616.3242 2931.9842 2957.4725 2977.0480 2984.6564 2987.4867 3010.7829 3046.9010 3049.3834 3052.6688 3062.1433 3117.7127 3122.4020 3124.1768 3125.8191 3129.5402 3141.3509 3141.8743 3152.2928 3165.6909 3167.9546 3168.3417 3169.5465 3171.0215 3543.6018
redmass: 9.2761 7.2599 5.7834 4.0946 5.4709 4.1607 4.7695 4.7533 5.8107 6.7491 4.7787 4.7418 5.8929 6.0518 4.4190 6.5510 9.3706 3.6545 5.2093 4.7538 5.0234 3.7788 5.2478 6.0066 5.7535 3.2523 5.3916 2.5105 7.5847 2.1879 2.8710 2.9381 2.9289 4.1375 3.6284 4.1709 5.7968 2.7066 1.4783 3.7020 2.1377 2.3032 6.2381 6.0808 5.9923 6.8577 6.4296 5.3907 4.5073 4.7210 1.8901 3.8139 3.7664 2.4159 2.8631 3.5214 3.0837 2.6917 1.2786 1.7391 1.2613 1.4422 1.5364 1.5436 4.5415 2.9560 1.5118 2.0126 1.3789 1.3757 1.3947 1.3823 1.8313 1.6944 2.5448 1.4733 4.0764 4.1663 3.1432 2.4302 2.1404 3.7833 2.5149 2.7595 2.7254 1.5594 1.8081 1.3828 2.2345 1.8551 3.2095 1.0494 1.1136 1.1333 1.1087 2.0771 1.5505 2.6355 1.5748 1.6499 1.4168 1.3552 1.2771 1.3604 1.7592 1.3677 1.3541 1.2887 1.4284 1.2447 1.6546 1.4264 5.3251 5.4373 3.6934 2.3752 2.2919 1.0948 1.1932 1.0882 2.0022 1.2435 1.2324 2.1523 1.5840 2.4932 7.2802 7.3664 6.0779 6.0559 6.2741 6.2056 1.0652 1.0671 1.0633 1.0624 1.0622 1.0952 1.0980 1.0983 1.0988 1.1035 1.0869 1.0909 1.0906 1.0899 1.0863 1.0927 1.0888 1.0951 1.0947 1.0952 1.1013 1.0955 1.0964 1.0758
irintensity: 0.0996 0.4466 0.6045 0.1276 1.2826 0.3965 0.8220 1.3314 0.2352 0.9628 0.7945 0.5749 2.4056 0.2174 1.4694 5.8392 10.1449 1.1819 2.8536 3.2207 1.8429 1.6794 4.7835 2.4893 1.3228 2.4218 30.7535 10.1277 35.3599 3.2721 2.6834 0.4125 0.2251 6.7869 8.7220 8.4941 51.6169 16.4915 98.4289 30.0955 20.2215 22.4316 5.8720 2.6059 38.0425 2.1971 8.0188 44.7319 11.3706 63.2138 46.7123 9.4778 5.9647 17.7576 112.1427 23.1402 36.2948 30.7784 3.8704 62.1128 2.7756 45.7197 52.2937 38.5641 125.2800 121.3024 22.4681 39.8162 4.9017 0.1707 0.2991 2.6752 20.4945 0.2845 4.9416 8.1898 73.7560 34.2398 54.5543 26.6437 15.9868 44.1538 37.0665 40.1933 39.5089 17.9765 60.0966 13.2487 39.8749 23.4613 86.0091 0.6384 0.7894 1.1505 4.7503 3.6749 9.0273 11.0273 44.9832 17.6638 37.1031 3.8830 7.8304 2.9109 131.4086 16.8117 0.1069 8.0537 17.8879 11.2951 67.5154 5.2961 1.3168 2.9256 28.3349 1.5389 4.4194 6.5195 9.3391 15.0005 16.8127 40.7766 24.9202 79.2431 51.9432 151.2630 1.8615 3.1372 5.6907 12.2097 8.6571 138.0027 47.5804 37.5902 47.4663 21.9553 31.2374 11.4366 3.2623 27.0308 22.9597 43.1177 11.2621 5.6774 5.4513 10.2364 1.5786 23.8474 6.3980 34.3123 4.0876 8.1165 17.4614 3.2156 0.7674 26.6373
temp: 298.150 k
press: 1.00000 atm
elementType: 17 17 15 8 7 7 7 6 6 6 6 6 6 6 6 6 6 6 6 6 6 6 6 6 6 6 6 6 6 6 1 1 1 1 1 1 1 1 1 1 1 1 1 1 1 1 1 1 1 1 1 1 1 1
symmnumber: 1
zpe: 1107386.9 jmol-1
zpe.correction: 0.421781 hartree
zpe.thermalcorrener: 0.450188 hartree
zpe.thermalcorrenthalpy: 0.451132 hartree
zpe.thermalcorrgfe: 0.355503 hartree
zpe.sumelectzpe: -2389.496318 hartree
zpe.sumelectthermal: -2389.467912 hartree
zpe.sumelectthermalent: -2389.466968 hartree
zpe.sumelectthermalfe: -2389.562597 hartree
dipole: -1.4941 1.7617 4.4974
dipole: 5.0559
quadrupole: -210.9124 -198.6186 -202.5574
quadrupole: -5.1412 -2.8819 3.9352
quadrupole: -6.8829 5.4108 1.4721 -5.1412 -2.8819 3.9352
hfenergy: -2389.9180995 hartree
pointgroup: C01 [X(C23H24Cl2N3O1P1)]
dipole: 0.3344107 -0.8120023 1.7848117 debye
polarizability: 350.9951418|5.409523|389.6725503|-18.2887823|-11.1918543|196.6428747 unknown
InChI: InChI=1S/C23H24Cl2N3OP/c24-21-11-7-19(8-12-21)17-27-15-4-16-28(18-20-9-13-22(25)14-10-20)30(27,29)26-23-5-2-1-3-6-23/h1-3,5-14,26H,4,15-18H2
charge 0 multiplicity 1
54 atoms
Cl 6.312047 3.155411 -0.921652
Cl -5.85433 5.536276 0.334417
P  -0.388924 -0.785816 -0.508164
O  -0.233737 -0.664897 -2.096199
N  1.115989 -1.19232 0.261498
N  -0.989227 0.669497 0.282826
N  -1.563882 -1.9003 0.15465
C  1.222188 -0.947642 1.721311
C  -0.718638 0.747573 1.752052
C  0.766394 0.480981 2.120848
C  2.315604 -1.532309 -0.532323
C  -0.910069 1.936333 -0.486043
C  3.322847 -0.387886 -0.63455
C  -2.129709 2.822658 -0.252875
C  -1.488582 -3.316429 0.161012
C  3.025994 0.743374 -1.440229
C  -1.979514 4.197094 0.050873
C  4.54961 -0.421236 0.070973
C  -3.438333 2.290205 -0.371815
C  -2.374874 -4.053112 0.993562
C  -0.549027 -4.016056 -0.643215
C  3.929893 1.822959 -1.535616
C  -3.106345 5.034209 0.23011
C  5.467435 0.653636 -0.007098
C  -4.575698 3.106531 -0.197074
C  -2.318281 -5.462369 1.019731
C  -0.490786 -5.424761 -0.594618
C  5.137602 1.760511 -0.809728
C  -4.389038 4.471506 0.102413
C  -1.370501 -6.159043 0.234074
H  2.278385 -1.094675 2.009463
H  0.621311 -1.700194 2.274627
H  -1.359878 0.011251 2.275288
H  -1.036507 1.749579 2.091227
H  0.888184 0.604371 3.215086
H  1.41982 1.222492 1.623134
H  1.965867 -1.806668 -1.544827
H  2.794064 -2.426449 -0.085226
H  -0.842706 1.656421 -1.556198
H  0.013184 2.506047 -0.2411
H  -2.442691 -1.46963 0.451245
H  2.084397 0.764089 -2.003643
H  -0.975478 4.627745 0.148616
H  4.803145 -1.29506 0.684008
H  -3.561459 1.226228 -0.601185
H  -3.101195 -3.520545 1.620118
H  0.101104 -3.46477 -1.330834
H  3.707898 2.688674 -2.166614
H  -2.986648 6.095407 0.466504
H  6.414711 0.62705 0.539165
H  -5.584645 2.695375 -0.295708
H  -3.012716 -6.016293 1.661713
H  0.235049 -5.951487 -1.224557
H  -1.326203 -7.252733 0.259345
