program: Gaussian 09
title: 000249150
version: EM64L-G09RevD.01
frameworkgroup: C1[X(C13H18Cl2N3OP)]
method: RPBEPBE
basis: SDD
operation: Freq
keyword: #p
keyword: freq=noraman
keyword: PBEPBE/SDD
title: #p freq=noraman PBEPBE/SDD
converged: YES YES NO NO
title: Mulliken charges:
elementType: Cl Cl P O N N N C C C C C C C C C C C C C H H H H H H H H H H H H H H H H H H
charge: -0.062860 -0.058038 1.343623 -0.580388 -0.685763 -0.856399 -0.490067 0.185275 -0.346095 -0.416666 0.438575 0.381867 -0.542251 -0.298311 -0.301885 -0.387769 -0.459064 -0.215670 -0.561266 -0.564475 0.217956 0.236735 0.214706 0.232953 0.221263 0.232592 0.329909 0.274431 0.229235 0.262439 0.243092 0.231454 0.233422 0.223085 0.292832 0.253818 0.284516 0.263186
chargesum: 0.00000
title: Mulliken charges with hydrogens summed into heavy atoms:
elementType: Cl Cl P O N N N C C C C C C C C C C C C C
charge: -0.062860 -0.058038 1.343623 -0.580388 -0.685763 -0.526489 -0.490067 0.185275 0.108596 0.030994 0.438575 0.381867 -0.088396 0.205355 0.203646 -0.156315 -0.225641 0.007414 -0.014615 -0.016772
polarizability: 2.65392766e+02 2.19251360e+01 1.77522087e+02 -8.66297640e+00 1.25642927e+01 1.67577325e+02
1716.lowfreq: -10.2499 -2.7668 -0.0017 -0.0017 -0.0015 2.7007 17.1577 28.4118 33.9659
frequency: 16.8683 28.3378 33.8282 40.9734 70.2116 87.4995 90.6411 96.9113 109.3116 161.9263 174.3787 197.1100 203.9761 215.1878 225.9226 256.5666 275.1598 299.3029 301.1939 326.9460 386.2594 388.3124 434.5689 439.8055 466.6384 480.0240 493.3297 511.1570 533.2026 563.6455 593.8005 618.6515 654.6511 688.6854 697.8354 737.4161 752.5181 769.2854 775.3828 779.7747 788.2681 837.1451 861.5209 878.0589 882.7601 933.2326 948.6718 951.0752 999.4730 1018.1397 1032.4665 1040.0817 1043.5081 1047.2639 1060.2391 1068.5400 1082.3678 1117.7563 1130.9068 1175.7505 1188.7201 1195.5192 1209.1411 1227.1607 1230.9854 1249.9076 1255.2842 1256.8776 1273.1355 1285.2222 1292.0711 1326.5693 1328.3910 1331.8003 1346.3856 1348.5054 1363.4595 1368.8702 1415.6854 1446.9954 1452.5052 1455.0826 1459.4067 1465.6634 1470.7531 1472.8307 1482.0813 1493.3085 1612.5660 1623.9339 2956.6891 2968.8654 3000.8631 3004.9818 3017.3105 3040.0113 3044.7055 3055.3357 3059.1312 3064.5562 3071.1648 3088.4102 3126.3542 3141.0419 3147.4997 3148.9928 3162.9390 3605.4300
redmass: 7.2779 7.5430 12.2070 6.9618 4.8986 4.7177 2.4234 2.4922 2.7443 4.0092 5.3876 4.5167 5.1917 4.7054 9.5535 3.7903 5.6403 1.9663 3.4570 3.8007 4.2207 7.1456 3.7010 4.7505 1.7878 2.5936 4.0541 5.0305 4.9328 4.1570 5.0408 3.0420 7.5894 5.3343 4.5360 2.0250 5.2646 2.0565 1.1853 1.1738 4.5677 2.8747 1.5339 2.5183 1.4553 3.0792 1.3270 2.6739 1.4576 3.3405 4.1037 2.2406 2.7519 3.7516 2.1645 2.0538 2.0331 1.4767 2.5445 1.2417 1.4069 1.4046 2.5789 1.3725 1.6045 1.1609 1.3377 1.2440 2.6203 1.6317 1.1694 2.0102 1.2270 1.5106 1.2940 1.3392 1.2603 1.5696 3.6581 1.0808 1.0935 1.1865 1.0865 1.1267 1.0847 1.4232 2.3258 2.3714 7.7805 7.6932 1.0660 1.0662 1.0605 1.0619 1.0615 1.0962 1.0941 1.0567 1.0604 1.0993 1.1046 1.1027 1.0868 1.0911 1.1122 1.1122 1.0987 1.0785
irintensity: 0.1341 0.0837 0.4986 0.3404 2.0232 3.2964 1.1289 3.2457 1.8820 5.3913 1.4471 2.5572 4.6176 1.5212 8.7153 4.7566 11.9098 7.4913 20.3020 6.2717 2.7473 4.2428 23.8555 20.5336 61.2529 70.8990 32.4590 8.9966 10.3926 2.0343 4.0669 1.1872 5.7901 102.8954 143.4806 47.8114 29.8682 31.8074 34.6415 11.7719 114.8446 51.7542 15.4290 4.1901 1.4910 8.0688 0.9212 142.9681 0.9810 28.7162 85.8439 11.9530 8.1172 5.6399 26.3126 29.0624 31.9257 47.2797 80.6374 1.1446 30.8847 6.8860 65.3063 30.9747 18.3645 14.0900 2.1950 20.0402 30.4452 16.8274 6.7418 177.8655 17.8183 44.9970 3.3179 3.7894 3.9177 23.7331 0.8892 11.2051 2.7283 11.8226 28.3110 14.0858 10.4252 47.4458 32.1265 154.2124 11.3798 12.4073 46.7500 35.7969 13.1116 22.5555 16.8065 17.7815 37.5069 16.0849 14.7668 10.0658 37.9253 1.3025 3.6642 17.6669 8.0117 12.7821 24.7449 55.9085
temp: 298.150 k
press: 1.00000 atm
elementType: 17 17 15 8 7 7 7 6 6 6 6 6 6 6 6 6 6 6 6 6 1 1 1 1 1 1 1 1 1 1 1 1 1 1 1 1 1 1
symmnumber: 1
zpe: 786589.7 jmol-1
zpe.correction: 0.299596 hartree
zpe.thermalcorrener: 0.319994 hartree
zpe.thermalcorrenthalpy: 0.320939 hartree
zpe.thermalcorrgfe: 0.247681 hartree
zpe.sumelectzpe: -2005.507283 hartree
zpe.sumelectthermal: -2005.486884 hartree
zpe.sumelectthermalent: -2005.485940 hartree
zpe.sumelectthermalfe: -2005.559198 hartree
dipole: 2.9812 0.5131 -1.4144
dipole: 3.3394
quadrupole: -151.5625 -152.8941 -134.5533
quadrupole: -8.5551 -0.5334 19.7552
quadrupole: -5.2258 -6.5575 11.7833 -8.5551 -0.5334 19.7552
hfenergy: -2005.8068787 hartree
pointgroup: C01 [X(C13H18Cl2N3O1P1)]
dipole: 1.0932628 0.252391 -0.6834844 debye
polarizability: 245.6631481|34.2896204|201.6555932|-26.1008161|-7.1351096|163.173438 unknown
InChI: InChI=1S/C13H18Cl2N3OP/c14-6-9-17(10-7-15)20(19)16-12-5-1-3-11-4-2-8-18(20)13(11)12/h1,3,5,16H,2,4,6-10H2
charge 0 multiplicity 1
38 atoms
Cl -5.218033 -2.88951 0.953957
Cl -2.525868 2.368239 -2.948043
P  -0.662217 -0.295899 1.25062
O  -1.034157 -1.07494 2.596499
N  0.679379 -0.803336 0.230434
N  0.05826 1.313094 1.358965
N  -2.089298 -0.261644 0.235472
C  1.672823 0.19418 0.091001
C  0.890697 -2.155474 -0.323032
C  2.406908 -2.459393 -0.412917
C  2.89524 0.01508 -0.583449
C  1.326506 1.416477 0.731899
C  3.172801 -1.353791 -1.188579
C  -3.37155 -0.787857 0.75786
C  -2.041243 0.28645 -1.134355
C  2.211731 2.509029 0.688531
C  3.782637 1.11973 -0.618053
C  3.443032 2.34599 0.000898
C  -3.491251 -2.292439 0.465892
C  -2.459237 1.767513 -1.155319
H  0.435044 -2.225976 -1.332689
H  0.391631 -2.895483 0.329347
H  2.53759 -3.437805 -0.910662
H  2.817456 -2.544888 0.610349
H  2.863133 -1.372794 -2.254064
H  4.257519 -1.566303 -1.174076
H  -0.287139 2.018986 2.006996
H  -3.426869 -0.625943 1.847295
H  -4.20614 -0.239733 0.283099
H  -1.019222 0.185648 -1.54257
H  -2.715465 -0.298346 -1.787863
H  1.963794 3.45873 1.174424
H  4.747683 1.016622 -1.127886
H  4.14454 3.185825 -0.041988
H  -2.785129 -2.874614 1.075601
H  -3.386186 -2.525199 -0.604912
H  -1.725565 2.40871 -0.646661
H  -3.470738 1.925261 -0.751618
