program: Gaussian 09
title: 000249149
version: EM64L-G09RevD.01
frameworkgroup: C1[X(C22H24Cl2N4O)]
method: RPBEPBE
basis: SDD
operation: Freq
keyword: #p
keyword: freq=noraman
keyword: PBEPBE/SDD
title: #p freq=noraman PBEPBE/SDD
converged: YES YES NO NO
title: Mulliken charges:
elementType: Cl Cl O N N N N C C C C C C C C C C C C C C C C C C C C C C H H H H H H H H H H H H H H H H H H H H H H H H
charge: -0.059637 -0.056155 -0.233205 -0.169103 -0.399582 -0.371340 0.028618 0.314441 0.103547 -0.544694 0.228766 -0.407840 -0.503261 -0.391051 -0.389953 0.454934 -0.418739 -0.344065 -0.251827 -0.220663 0.194861 -0.367119 -0.352651 -0.584149 -0.583644 0.474177 -0.426681 -0.409239 -0.398309 0.229001 0.227532 0.271882 0.234497 0.243817 0.308980 0.248560 0.250191 0.247263 0.252605 0.240966 0.232080 0.227400 0.226665 0.231062 0.233169 0.293775 0.269052 0.295571 0.267139 0.226550 0.281906 0.327585 0.216314
chargesum: 0.00000
title: Mulliken charges with hydrogens summed into heavy atoms:
elementType: Cl Cl O N N N N C C C C C C C C C C C C C C C C C C C C C C
charge: -0.059637 -0.056155 -0.233205 -0.169103 -0.090602 -0.043755 0.028618 0.314441 0.103547 -0.088161 0.228766 -0.135958 -0.024948 0.107700 0.109915 0.454934 -0.177773 -0.111986 -0.024427 0.006002 0.194861 -0.136057 -0.119482 -0.021321 -0.020935 0.474177 -0.200131 -0.127332 -0.181996
polarizability: 4.54502230e+02 5.76774349e+01 3.43391222e+02 3.30100479e+01 1.49342796e+01 1.96434429e+02
1716.lowfreq: -8.5496 -3.6644 -1.8503 -0.0010 -0.0008 0.0016 7.5835 14.2087 15.2821
frequency: 6.4816 14.1202 15.2458 22.7522 27.4251 28.8142 38.5106 50.7610 59.2862 65.3754 89.9260 97.5500 121.1993 129.1909 148.2301 180.1433 186.8250 199.9130 207.6721 214.8924 225.2649 234.6677 239.7508 262.3547 292.0894 298.6834 342.0001 347.6957 401.6730 408.8013 422.2664 426.0393 440.7446 456.4194 489.6458 522.9485 527.2918 539.4062 543.0094 550.4935 561.7224 575.4080 592.3383 624.6225 636.2245 652.0317 668.2277 692.6508 694.4580 695.3801 735.2818 737.2415 752.6581 753.3882 762.7163 782.2017 789.0324 801.8002 808.5847 833.3481 835.0597 854.6519 865.2255 874.8927 926.1721 929.0052 937.4689 951.6229 958.4471 976.5294 978.0981 987.2951 997.2982 998.4912 1000.4537 1012.0576 1034.1693 1035.1518 1040.8170 1066.4720 1075.5404 1099.1611 1118.7789 1134.0961 1137.1359 1157.5612 1171.9943 1179.7227 1186.4661 1200.7578 1220.0885 1235.9147 1251.4176 1254.1981 1255.6960 1257.0748 1264.4109 1275.8954 1291.1244 1295.3621 1307.1647 1320.0244 1333.6232 1343.6004 1350.6830 1351.6595 1354.0160 1377.0546 1388.5023 1392.6800 1422.4201 1438.4128 1446.3257 1457.7049 1458.8354 1459.1948 1472.3772 1481.4068 1482.7439 1501.1683 1506.7665 1523.2450 1550.9715 1551.4278 1582.4402 1585.5047 1625.9100 1629.4854 1633.5436 2969.0420 2984.2508 2989.9558 3013.5372 3018.9567 3041.0471 3062.5038 3063.5733 3069.3066 3069.8490 3075.6011 3116.8582 3126.6919 3133.3698 3144.4833 3147.3982 3147.7561 3148.5971 3158.0101 3165.3305 3166.1580 3220.5045 3333.6363 3608.4890
redmass: 7.9264 5.6454 7.2887 6.6998 12.4763 9.2379 7.5226 5.9497 6.2013 4.0720 4.5697 3.4768 3.8419 2.6261 3.3818 5.1026 6.3210 4.5251 4.6559 4.0303 5.6415 2.7220 4.4598 3.2897 4.1153 4.9113 5.4076 5.0359 3.5365 4.0715 2.8625 3.1487 3.6446 4.0018 3.2459 3.0951 1.5890 2.8777 2.8994 5.2477 4.8112 2.8181 4.0432 3.6864 5.4462 4.6743 6.1700 1.3813 2.7934 5.0491 3.9681 3.7343 2.9701 1.6260 3.7326 1.1266 1.1847 1.4039 1.3527 1.5366 4.7400 1.4381 4.5963 2.5004 3.0379 1.4022 1.3758 2.7742 1.5222 1.3105 2.5839 1.3505 2.7942 1.4603 3.2646 2.1695 4.1725 2.3245 2.0324 5.3685 3.8082 1.6385 1.5201 1.4387 1.3858 1.1879 1.1006 1.6286 1.9557 1.1491 2.1378 2.4824 1.5474 1.4404 1.2123 1.1938 1.6405 1.3307 1.1895 2.2838 1.4570 1.5251 1.4270 1.6689 1.3118 1.4075 1.7171 3.5769 1.8831 5.0983 2.2698 3.6185 1.0865 3.8101 1.1021 1.0975 1.1415 2.8703 1.0914 1.2183 1.6008 2.5998 5.7425 6.1639 5.9522 5.1732 6.5307 6.8671 6.9787 1.0870 1.0630 1.0662 1.0601 1.0609 1.0975 1.0575 1.0590 1.0956 1.1017 1.1035 1.0890 1.0852 1.0892 1.0893 1.0952 1.1097 1.1117 1.0934 1.1001 1.0963 1.0981 1.0773 1.0810
irintensity: 0.1407 0.2374 0.8794 1.1602 0.9246 1.4593 5.2788 0.5434 2.5695 1.2448 4.1520 1.3165 3.8925 0.6662 1.6261 1.6051 1.5135 5.4118 5.1296 12.0273 9.6110 1.0021 15.4331 2.9294 2.2919 7.6604 4.2027 10.6792 3.7127 1.5352 16.3051 2.6038 7.4977 3.3042 5.8939 15.4719 72.8606 23.5232 19.9178 1.2994 2.9703 13.3741 6.3680 1.4307 3.0097 10.1968 98.5982 49.6254 19.1333 68.0137 6.5537 5.6743 23.7893 102.2237 14.5462 3.0539 10.2797 16.8027 16.5765 39.1648 11.7109 1.2669 3.8388 25.4363 6.7648 12.2587 3.6825 48.5181 14.1938 0.4523 8.2199 2.6027 0.8651 4.1342 1.2881 7.9645 0.3526 0.3659 2.7185 62.7996 7.5324 36.6699 37.1804 3.5414 6.4385 2.7978 6.8547 139.0915 243.5396 67.2418 34.1953 19.4178 1.9713 1.4529 14.5422 16.6121 136.1394 51.9758 8.3470 1.6041 1.8843 14.8262 12.2528 3.3117 16.2319 95.2939 14.9856 12.3798 89.3026 35.8309 2.8760 13.8602 24.1538 13.4545 13.6552 11.9881 17.0272 0.9160 27.0459 63.8166 490.0846 19.3270 7.5976 8.9879 0.3644 27.1419 438.6246 28.2560 226.3541 66.2064 35.7595 19.2178 24.6129 24.6973 24.1398 12.3989 15.7630 20.1427 10.5496 9.5063 17.5599 1.3765 2.6318 13.8335 27.7293 6.2432 16.6158 25.0308 20.2471 13.7704 0.3383 142.8677 69.1937
temp: 298.150 k
press: 1.00000 atm
elementType: 17 17 8 7 7 7 7 6 6 6 6 6 6 6 6 6 6 6 6 6 6 6 6 6 6 6 6 6 6 1 1 1 1 1 1 1 1 1 1 1 1 1 1 1 1 1 1 1 1 1 1 1 1
symmnumber: 1
zpe: 1104455.0 jmol-1
zpe.correction: 0.420665 hartree
zpe.thermalcorrener: 0.448751 hartree
zpe.thermalcorrenthalpy: 0.449695 hartree
zpe.thermalcorrgfe: 0.354563 hartree
zpe.sumelectzpe: -2064.975007 hartree
zpe.sumelectthermal: -2064.946921 hartree
zpe.sumelectthermalent: -2064.945977 hartree
zpe.sumelectthermalfe: -2065.041109 hartree
dipole: -3.3664 6.0645 -1.0944
dipole: 7.0220
quadrupole: -161.8934 -213.9299 -176.2672
quadrupole: -12.8848 13.8038 -6.1297
quadrupole: 22.1368 -29.8997 7.7630 -12.8848 13.8038 -6.1297
hfenergy: -2065.3956722 hartree
pointgroup: C01 [X(C22H24Cl2N4O1)]
dipole: -1.1345717 2.5115398 -0.1932252 debye
polarizability: 459.0711813|43.4425521|330.8339402|49.3580097|29.3428966|204.422759 unknown
InChI: InChI=1S/C22H24Cl2N4O/c23-11-13-28(14-12-24)19-8-5-17(6-9-19)15-26-27-22(29)10-7-18-16-25-21-4-2-1-3-20(18)21/h1-6,8-9,15-16,25,27H,7,10-14H2
charge 0 multiplicity 1
53 atoms
Cl 7.013185 3.50332 -0.043741
Cl 7.332108 -3.854139 0.392446
O  -2.814054 -3.755403 -1.205698
N  5.274037 -0.26477 0.05341
N  -5.043572 2.143586 -1.490598
N  -2.497531 -1.493553 -0.652207
N  -1.112546 -1.575019 -0.606961
C  -5.078146 0.170183 -0.32666
C  -4.394612 1.178753 0.4744
C  -5.348321 -1.273032 0.056665
C  -4.385135 2.404905 -0.284479
C  -5.455862 0.804185 -1.51433
C  -4.801397 -2.349869 -0.928513
C  5.968788 0.954531 0.499579
C  6.111321 -1.425021 -0.298463
C  3.864486 -0.317122 -0.033232
C  -3.779555 1.163177 1.75726
C  -3.789681 3.592045 0.197125
C  -3.181207 2.342409 2.240599
C  -3.186673 3.544326 1.469894
C  -3.282964 -2.61671 -0.940511
C  3.058872 0.82766 0.253808
C  3.188976 -1.522829 -0.412708
C  6.166359 1.933437 -0.673861
C  6.247337 -2.389435 0.895547
C  0.989831 -0.434172 -0.210144
C  1.657248 0.761439 0.167626
C  1.791585 -1.575348 -0.499956
C  -0.470604 -0.46618 -0.287886
H  -6.441926 -1.430965 0.135805
H  -4.942548 -1.468608 1.067069
H  -5.9926 0.401744 -2.371893
H  -5.109667 -2.101312 -1.963895
H  -5.25897 -3.327823 -0.697439
H  -5.188741 2.815671 -2.240776
H  6.955963 0.681225 0.912106
H  5.412696 1.449847 1.315005
H  7.115662 -1.071476 -0.591606
H  5.698498 -1.960391 -1.171257
H  -3.771048 0.25071 2.364189
H  -3.793188 4.517308 -0.389768
H  -2.705643 2.343675 3.227391
H  -2.716785 4.446053 1.877693
H  3.516497 1.778332 0.542713
H  3.755008 -2.431403 -0.638494
H  5.21311 2.259417 -1.113438
H  6.829874 1.525806 -1.450963
H  5.283125 -2.818212 1.203275
H  6.752904 -1.922012 1.753731
H  1.067992 1.658734 0.396277
H  1.288976 -2.504052 -0.789381
H  -2.976114 -0.591929 -0.487968
H  -1.001047 0.481102 -0.057584
