program: Gaussian 09
title: 000249148
version: EM64L-G09RevD.01
frameworkgroup: C1[X(C18H20N2O2)]
method: RPBEPBE
basis: SDD
operation: Freq
keyword: #p
keyword: freq=noraman
keyword: PBEPBE/SDD
title: #p freq=noraman PBEPBE/SDD
converged: YES YES NO NO
title: Mulliken charges:
elementType: O O N N C C C C C C C C C C C C C C C C C C H H H H H H H H H H H H H H H H H H H H
charge: -0.430505 -0.446545 -0.160405 -0.016954 0.430876 -0.442603 -0.422644 0.526186 -0.371283 -0.364422 -0.360719 -0.487877 -0.389648 0.402990 -0.328060 -0.326704 -0.379911 -0.400059 -0.204231 -0.229530 -0.225587 -0.244991 0.214853 0.244874 0.244065 0.246965 0.259999 0.219692 0.235592 0.228210 0.241484 0.227448 0.218960 0.197165 0.220974 0.243734 0.254199 0.226548 0.229301 0.230289 0.337339 0.350934
chargesum: 0.00000
title: Mulliken charges with hydrogens summed into heavy atoms:
elementType: O O N N C C C C C C C C C C C C C C C C C C
charge: -0.093166 -0.095610 -0.160405 -0.016954 0.430876 0.017124 0.068386 0.526186 -0.111284 -0.144730 -0.125127 -0.259667 -0.148163 0.402990 0.118348 0.091435 -0.136178 -0.145860 -0.204231 -0.002981 0.003714 -0.014703
polarizability: 2.87725387e+02 6.78857580e+00 1.88014621e+02 1.90798947e+01 -5.24692136e+00 1.73738253e+02
1716.lowfreq: -9.2422 -3.2261 -0.0006 0.0002 0.0003 4.6736 14.8707 23.1356 28.7603
frequency: 10.2870 22.7676 28.5019 39.8829 50.4076 60.1297 68.6955 90.6591 106.8341 120.1419 128.4423 154.2176 181.0277 220.9622 243.0129 254.8087 273.1779 287.3504 295.9187 309.6732 329.3919 342.2094 383.5356 395.8420 403.4328 418.8512 435.8034 472.7569 478.3575 534.8233 585.7616 597.9023 617.1841 629.3369 647.1305 702.3091 723.0368 731.4201 760.0530 795.4058 802.4656 812.5180 818.1668 826.2327 850.3065 856.7347 929.3383 930.9049 952.0916 956.5673 964.2147 971.5072 980.9902 984.0647 991.2929 998.0774 998.2286 1000.4411 1024.6695 1029.1111 1045.9466 1088.0981 1099.8273 1131.1901 1155.3882 1173.2522 1180.5049 1190.9677 1193.8663 1197.5332 1207.3781 1213.3135 1228.0658 1230.9122 1259.1216 1281.5140 1293.9296 1299.3826 1324.9087 1328.8739 1341.8312 1352.2372 1377.2263 1380.5734 1382.5110 1392.0222 1413.5885 1433.3419 1438.5363 1471.9753 1481.6715 1482.5024 1488.1342 1501.6895 1521.1866 1568.7366 1594.7671 1613.1945 1630.3185 2187.9023 2949.1819 2967.7160 2979.4635 2985.7262 3003.1929 3017.0397 3048.4835 3076.0770 3088.0142 3113.7035 3122.3902 3128.6804 3128.8930 3139.2849 3149.0115 3157.9091 3164.9710 3166.0511 3566.4381 3581.5546
redmass: 6.1783 4.2721 5.0716 5.4146 6.4681 5.6603 4.0331 5.9913 2.2301 6.0498 2.3982 5.0806 4.0375 3.9485 3.8398 1.1248 1.9528 1.8161 3.4902 6.1523 4.9770 4.7568 4.0146 3.7318 2.8279 3.1413 5.5364 4.4498 3.6577 2.6012 4.5563 4.4186 6.3983 6.2191 5.8886 2.3251 2.0840 3.1756 3.1061 1.4183 1.1542 1.6333 2.3756 1.3386 3.6305 1.2938 1.4543 1.4809 1.4892 2.7778 4.5086 3.6474 1.4039 5.1580 6.0740 1.4719 2.4147 2.9443 4.1090 2.2083 1.5466 1.5910 1.5259 1.5698 1.4770 1.0531 2.3191 1.3394 1.2621 1.3910 1.2265 1.1880 2.2884 2.0205 1.4107 1.3320 1.1822 1.1634 1.3033 1.3517 1.2718 1.2534 2.5229 1.8493 6.4543 2.0644 1.4046 3.4131 2.2470 1.0849 1.0827 2.2277 1.0859 1.1469 2.5899 6.6945 6.2695 6.0012 6.3375 12.5855 1.0561 1.0811 1.0631 1.0676 1.1058 1.0605 1.0968 1.1049 1.1011 1.0893 1.0853 1.0886 1.0880 1.0920 1.0962 1.0928 1.1015 1.0937 1.0665 1.0668
irintensity: 0.1588 0.0453 0.0048 0.2409 3.4133 0.0481 0.6723 2.6908 17.5613 4.7787 1.7873 3.0931 1.1053 8.8608 3.5913 142.8656 61.4906 68.6166 5.4669 21.0915 14.0495 9.2926 0.8925 10.8437 0.2208 2.8734 1.4965 1.0399 9.1877 17.5424 13.9733 7.2289 0.0804 5.4051 3.9567 26.5436 57.9935 23.1060 5.1813 23.9916 11.7037 40.5563 9.8065 7.2163 4.7108 0.2619 2.5410 2.3430 3.6156 85.6014 117.6203 8.0119 0.0906 55.3492 0.9782 0.4220 0.8905 8.6848 10.1663 9.9128 25.5731 5.7102 0.4908 2.3342 31.2945 0.0230 14.5728 66.9579 15.1673 6.6290 33.5020 1.0080 9.4488 29.2884 3.9264 16.6352 1.5474 3.3822 0.6534 3.3782 7.7972 40.6524 13.7664 13.4435 0.5563 80.2704 1.8883 4.1143 13.3585 8.1586 9.4685 27.2353 17.8918 7.4169 254.6486 6.6149 1.0391 9.2183 212.2847 13.1165 49.3305 5.2980 15.4543 70.2420 41.4400 34.5720 14.4016 27.9790 32.0014 15.5225 2.7998 7.9062 4.2289 12.5196 30.2282 30.3432 26.6944 11.2648 11.3883 5.6055
temp: 298.150 k
press: 1.00000 atm
elementType: 8 8 7 7 6 6 6 6 6 6 6 6 6 6 6 6 6 6 6 6 6 6 1 1 1 1 1 1 1 1 1 1 1 1 1 1 1 1 1 1 1 1
symmnumber: 1
zpe: 893138.3 jmol-1
zpe.correction: 0.340178 hartree
zpe.thermalcorrener: 0.361959 hartree
zpe.thermalcorrenthalpy: 0.362903 hartree
zpe.thermalcorrgfe: 0.285571 hartree
zpe.sumelectzpe: -956.210200 hartree
zpe.sumelectthermal: -956.188420 hartree
zpe.sumelectthermalent: -956.187476 hartree
zpe.sumelectthermalfe: -956.264808 hartree
dipole: -1.0132 3.2477 -5.3308
dipole: 6.3239
quadrupole: -143.2655 -122.9027 -135.8454
quadrupole: 4.9303 -0.8079 8.7541
quadrupole: -9.2610 11.1018 -1.8409 4.9303 -0.8079 8.7541
hfenergy: -956.5503786 hartree
pointgroup: C01 [X(C18H20N2O2)]
dipole: -0.3313191 1.2488152 -2.1262574 debye
polarizability: 286.3138461|7.438981|187.9042696|22.7180918|-5.1497297|175.2601452 unknown
InChI: InChI=1S/C18H20N2O2/c19-14-18(15-4-2-1-3-5-15)16-6-8-17(9-7-16)20(10-12-21)11-13-22/h1-9,18,21-22H,10-13H2
charge 0 multiplicity 1
42 atoms
O  -5.870084 -2.234106 -1.255817
O  -4.197934 3.735989 0.954256
N  -3.255067 0.279681 -0.104409
N  2.851035 -2.310059 2.684012
C  -1.906853 -0.10551 -0.016585
C  -4.198193 -0.40523 -1.004033
C  -3.794441 1.388584 0.700534
C  0.864801 -0.884511 0.161883
C  2.340514 -1.308593 0.256987
C  -1.400651 -1.23216 -0.737747
C  -0.97626 0.617066 0.799801
C  -0.045009 -1.603164 -0.645474
C  0.370796 0.228722 0.884639
C  3.332601 -0.192087 -0.142878
C  -4.842342 -1.6660 -0.371401
C  -3.587309 2.764384 0.036128
C  3.124795 0.481698 -1.373558
C  4.450984 0.154434 0.651308
C  2.632695 -1.858472 1.601239
C  4.022231 1.481228 -1.80407
C  5.347689 1.161209 0.222189
C  5.13911 1.826046 -1.006128
H  -3.696854 -0.67267 -1.955601
H  -5.013995 0.29203 -1.268395
H  -3.344651 1.402071 1.708937
H  -4.878825 1.236243 0.845035
H  2.484111 -2.149421 -0.454228
H  -2.062087 -1.835095 -1.366004
H  -1.302531 1.489556 1.372475
H  0.302497 -2.479296 -1.208187
H  1.051984 0.808489 1.518848
H  -5.384702 -1.392067 0.548301
H  -4.068237 -2.415096 -0.108088
H  -4.082873 2.780528 -0.958154
H  -2.505217 2.964493 -0.105543
H  2.250561 0.230328 -1.98574
H  4.624416 -0.357453 1.604807
H  3.850689 1.992637 -2.757949
H  6.208055 1.422052 0.848553
H  5.83551 2.6041 -1.338022
H  -5.435425 -2.655701 -2.03934
H  -4.079031 4.652824 0.602218
