program: Gaussian 09
title: 000249144
version: EM64L-G09RevD.01
frameworkgroup: C1[X(C6H12O9S3)]
method: RPBEPBE
basis: SDD
operation: Freq
keyword: #p
keyword: freq=noraman
keyword: PBEPBE/SDD
title: #p freq=noraman PBEPBE/SDD
converged: YES YES NO NO
title: Mulliken charges:
elementType: S S S O O O O O O O O O C C C C C C H H H H H H H H H H H H
charge: 0.953424 1.067873 1.063547 -0.390903 -0.409500 -0.370063 -0.405047 -0.500574 -0.483770 -0.583357 -0.483061 -0.562033 -0.134894 -0.047621 -0.327162 -0.335247 -0.744838 -0.753516 0.292461 0.259367 0.293409 0.241246 0.267537 0.250224 0.283170 0.298690 0.331245 0.277683 0.294535 0.357176
chargesum: 0.00000
title: Mulliken charges with hydrogens summed into heavy atoms:
elementType: S S S O O O O O O O O O C C C C C C
charge: 0.953424 1.067873 1.063547 -0.390903 -0.409500 -0.370063 -0.405047 -0.500574 -0.483770 -0.583357 -0.483061 -0.562033 0.157567 0.211746 0.207493 0.182514 0.168267 0.175877
polarizability: 2.13479063e+02 -5.78291694e+00 1.76629287e+02 2.31031228e+00 5.32522567e+00 1.30545201e+02
1716.lowfreq: -8.2984 -0.0027 -0.0015 -0.0004 0.9064 4.7217 24.5858 39.5474 58.1456
frequency: 23.6160 39.4926 58.1329 64.0878 71.6404 76.0376 81.7760 98.1080 125.1744 150.4108 162.7102 172.6252 178.0522 186.2014 196.3151 208.6743 222.7979 230.5377 244.2661 255.3884 270.3459 285.6948 318.8656 337.9312 343.5795 354.7823 369.4255 393.9521 426.5558 455.3548 464.2190 467.5865 519.5928 530.1552 547.0785 583.2636 596.6482 701.8707 799.4985 824.7276 831.1815 864.5080 912.5159 920.4380 923.8291 925.6350 930.2414 942.1222 987.4605 999.0358 1004.6669 1048.4359 1050.4272 1056.0818 1063.9948 1106.0427 1194.1288 1224.0470 1231.1012 1282.9049 1300.1226 1323.2203 1329.1175 1330.6234 1353.4766 1376.7437 1409.5889 1416.0776 1418.4977 1426.2590 1434.9297 1444.7491 2993.3168 3000.6911 3003.9124 3011.2511 3017.2302 3035.2608 3075.9637 3086.9610 3153.3217 3163.3949 3186.6951 3187.7779
redmass: 6.3981 7.6990 8.7838 9.6334 6.6208 8.1413 8.9526 6.9838 8.6400 3.7992 4.1071 1.4156 5.2300 3.7410 3.6278 4.2635 1.9259 2.0960 4.7121 4.1815 5.3083 5.9986 10.7033 9.9545 8.8916 11.1697 3.3848 6.2035 7.1482 6.0122 6.7961 6.1363 8.8450 4.9793 8.7346 9.1356 9.0885 4.4795 4.1288 11.4616 12.3503 3.4172 7.1154 6.4426 4.2164 3.6364 4.3533 11.1642 1.5402 1.7737 1.3467 1.8742 1.9754 3.2252 1.9076 2.6767 1.1404 1.1484 1.2388 1.2267 1.2354 1.1286 1.1339 1.1816 1.2450 1.3180 1.0484 1.0438 1.0811 1.0534 1.0534 1.0767 1.0609 1.0611 1.0284 1.0800 1.0295 1.0844 1.1025 1.1046 1.1060 1.1084 1.1077 1.1076
irintensity: 1.7176 1.3585 0.2836 1.2200 17.0759 3.7673 0.9105 6.4759 3.1860 6.7082 10.0577 1.7767 4.7226 2.6328 2.4395 0.7627 9.0922 9.1647 3.0946 0.7864 0.2308 8.1973 17.2250 21.0459 20.9384 22.7031 19.7962 29.1203 11.2152 43.4843 32.5469 103.6461 65.0309 14.9117 27.7843 21.6438 41.7510 5.8650 38.2851 22.1397 92.9622 9.9509 28.6282 61.7391 48.8400 74.6043 212.0943 15.8234 23.0722 14.2408 19.2865 88.7920 62.3671 17.8775 23.4260 2.2841 2.4444 1.7331 5.2180 11.1986 0.3287 5.1613 8.1774 28.1095 16.4563 7.6585 6.3440 2.5789 33.3322 20.4601 10.8523 14.7102 5.8302 10.0033 30.3194 35.1553 23.1368 6.2666 9.7880 4.2386 30.3391 16.2931 1.8892 0.6306
temp: 298.150 k
press: 1.00000 atm
elementType: 16 16 16 8 8 8 8 8 8 8 8 8 6 6 6 6 6 6 1 1 1 1 1 1 1 1 1 1 1 1
symmnumber: 1
zpe: 516877.4 jmol-1
zpe.correction: 0.196868 hartree
zpe.thermalcorrener: 0.219146 hartree
zpe.thermalcorrenthalpy: 0.220090 hartree
zpe.thermalcorrgfe: 0.144589 hartree
zpe.sumelectzpe: -2105.127497 hartree
zpe.sumelectthermal: -2105.105219 hartree
zpe.sumelectthermalent: -2105.104275 hartree
zpe.sumelectthermalfe: -2105.179776 hartree
dipole: 2.7685 -1.6969 0.4868
dipole: 3.2834
quadrupole: -128.0322 -151.1728 -127.8427
quadrupole: 10.0407 -4.5679 12.7134
quadrupole: 7.6504 -15.4902 7.8399 10.0407 -4.5679 12.7134
hfenergy: -2105.3243649 hartree
pointgroup: C01 [X(C6H12O9S3)]
dipole: 0.9160394 -0.8929984 -0.1794005 debye
polarizability: 183.0391268|-14.5527857|207.1347854|-0.5036803|-6.7226626|130.4796394 unknown
InChI: InChI=1S/C6H12O9S3/c1-17(8,9)12-3-5-6(15-16(7)14-5)4-13-18(2,10)11/h5-6H,3-4H2,1-2H3
charge 0 multiplicity 1
30 atoms
S  -0.611725 3.633829 -1.274631
S  -2.333029 -1.723006 0.597013
S  2.353619 -1.517846 -0.513086
O  -0.766537 1.777949 -1.499092
O  0.648211 3.305798 0.120742
O  -2.681055 0.094809 0.190704
O  2.442453 0.076168 0.485363
O  -1.887579 4.21407 -0.496844
O  -3.650852 -2.340367 1.283698
O  -0.899757 -1.796928 1.373347
O  3.768377 -1.81122 -1.226735
O  1.012098 -1.482803 -1.438709
C  -0.454947 1.113674 -0.209951
C  0.776399 1.854765 0.380353
C  -1.667085 1.019263 0.729182
C  2.103221 1.335456 -0.214965
C  -2.149523 -2.367358 -1.182582
C  2.095493 -2.599061 1.02207
H  -0.143322 0.09905 -0.521677
H  0.807458 1.748063 1.480465
H  -2.210395 1.976145 0.824671
H  -1.334291 0.683011 1.731334
H  2.926163 2.03934 -0.004782
H  2.01742 1.188013 -1.309344
H  -2.200864 -3.46321 -1.11139
H  -2.993527 -1.93532 -1.73628
H  -1.170078 -2.005126 -1.529348
H  2.208424 -3.636223 0.676412
H  2.881333 -2.299169 1.727682
H  1.076299 -2.363367 1.367985
