program: Gaussian 09
title: 000249140
version: EM64L-G09RevD.01
frameworkgroup: C1[X(C12H26N4)]
method: RPBEPBE
basis: SDD
operation: Freq
keyword: #pfreq=noraman
keyword: PBEPBE/SDD
title: #p freq=noraman PBEPBE/SDD
converged: YES YES NO NO
title: Mulliken charges:
elementType: N N N N C C C C C C C C C C C C H H H H H H H H H H H H H H H H H H H H H H H H H H
charge: -0.106544 -0.173476 -0.623631 -0.623857 -0.384001 -0.381159 -0.372163 -0.372119 -0.369665 -0.353442 -0.393164 -0.356384 -0.445648 -0.696988 -0.229371 0.240228 0.194672 0.191067 0.191452 0.190442 0.187020 0.189856 0.188593 0.189723 0.187935 0.217032 0.187594 0.187167 0.201642 0.194589 0.194414 0.194796 0.210450 0.205379 0.209673 0.214359 0.209456 0.222419 0.299123 0.352012 0.303284 0.327234
chargesum: 0.00000
title: Mulliken charges with hydrogens summed into heavy atoms:
elementType: N N N N C C C C C C C C C C C C
charge: -0.106544 -0.173476 0.027503 0.006661 0.001738 0.000734 0.004714 0.006198 0.035302 0.021319 0.003067 0.032826 -0.029819 -0.063499 -0.006952 0.240228
polarizability: 1.95482237e+02 -3.17520935e+01 1.85508084e+02 5.48602542e+00 -5.02003846e+00 1.36383592e+02
1716.lowfreq: -4.9377 -0.0004 0.0005 0.0008 6.1303 8.6345 14.5234 19.8116 28.3482
frequency: 14.2706 19.1876 28.2133 44.4254 50.0986 69.6161 83.4949 109.9768 113.6858 117.5155 136.0387 145.4194 150.7690 171.8227 208.0111 232.2583 234.0280 248.4530 298.5302 337.8624 347.5403 365.7873 388.0106 415.6547 448.4064 466.7283 508.1556 517.8140 532.5252 610.9924 641.1249 718.7137 721.9800 725.8335 732.4586 759.5780 808.0100 833.3476 870.7338 888.1715 901.6713 930.2261 935.7656 976.0657 986.1417 996.1980 1010.8903 1021.9735 1033.8361 1047.2618 1057.2675 1068.1934 1080.5272 1082.0268 1089.6161 1119.6806 1124.0529 1162.8539 1184.8789 1187.3009 1214.1449 1223.2520 1247.0482 1256.9584 1274.0494 1280.0390 1287.0039 1289.0257 1293.5356 1296.4786 1304.1556 1318.0199 1335.0382 1343.3999 1353.5162 1355.2463 1359.0597 1389.3322 1450.6553 1458.1610 1458.5444 1462.3182 1462.4860 1466.8647 1473.0404 1477.8518 1479.1714 1484.2322 1485.8273 1487.5838 1536.1494 1593.3030 1608.6652 1633.9519 2947.3805 2948.8713 2949.6647 2952.8248 2953.5549 2959.2058 2962.1896 2966.8682 2968.8763 2970.8167 2981.1417 2985.8912 2993.9068 3002.7906 3009.1438 3011.3402 3023.7386 3034.3519 3040.8629 3047.1698 3067.3017 3069.4050 3475.6265 3543.5868 3664.1263 3692.1815
redmass: 4.6407 1.9277 2.7143 3.6357 3.8809 1.7216 2.7604 4.3417 1.9932 2.8230 2.6514 2.6194 2.1809 2.5326 3.4517 2.9160 1.1130 1.9683 1.5834 3.4924 2.7810 2.5491 2.4458 1.3896 3.0796 2.7177 2.7081 2.6982 1.2553 3.4139 2.5990 1.0601 1.0753 1.6635 1.1127 1.1732 1.2467 1.7477 1.3449 1.8994 4.4207 1.5848 1.3570 3.0006 1.7806 2.5173 2.8863 1.5171 1.8202 1.7441 2.3268 2.6702 2.4567 2.0579 2.2611 2.4491 2.2508 1.9652 1.6767 1.3901 1.4539 1.3267 1.3390 1.2863 1.2503 1.0267 1.1807 1.1470 1.1731 1.1041 1.2097 1.3492 1.5616 1.4919 1.6801 1.6152 1.6043 1.2169 1.0953 1.0750 1.0730 1.0770 1.0638 1.0838 1.0854 1.0426 1.0919 1.1775 2.2592 1.0974 2.1644 1.7349 2.7295 2.0717 1.0585 1.0585 1.0590 1.0611 1.0594 1.0597 1.0616 1.0585 1.0602 1.0368 1.0959 1.0973 1.0993 1.1003 1.0883 1.1022 1.1044 1.1037 1.1023 1.0994 1.1007 1.0993 1.0484 1.0449 1.0986 1.1033
irintensity: 0.6042 0.2018 0.5602 0.6137 0.0420 0.0331 0.7689 7.7980 1.7838 1.1083 3.3322 4.4431 1.0162 1.2111 2.8618 1.0262 0.0010 48.1343 94.9651 12.2411 8.0654 21.3693 34.3051 218.2183 11.9024 3.0378 11.7209 2.9221 167.1579 2.1333 38.7232 16.9648 0.3003 164.4472 6.3978 1.1784 5.7106 7.2723 4.0848 5.9538 36.7243 17.1339 1.7331 4.1362 1.5030 0.6301 3.9037 1.3104 3.7171 2.9761 6.8560 3.9139 0.7489 0.0644 2.7608 13.9190 39.1545 3.2818 1.7578 7.4020 1.8152 2.8644 0.1154 0.0832 0.0643 0.2014 0.4466 0.5273 0.3386 0.2174 5.6428 0.9762 7.5011 1.1468 0.1147 0.1104 5.0374 11.1964 19.2946 0.4627 0.0074 1.7428 0.0885 0.7299 2.3139 11.7989 2.8194 9.8100 36.3877 30.0199 269.8337 344.5048 19.4434 514.8665 2.1565 0.0923 1.6825 19.5797 0.9028 31.6219 17.5322 71.8987 215.6076 35.6795 1.2600 1.2354 1.3515 4.8453 15.2101 4.7642 4.5870 13.1627 122.7586 175.2669 98.0538 55.8112 39.5531 48.0797 49.9140 26.7669
temp: 298.150 k
press: 1.00000 atm
elementType: 7 7 7 7 6 6 6 6 6 6 6 6 6 6 6 6 1 1 1 1 1 1 1 1 1 1 1 1 1 1 1 1 1 1 1 1 1 1 1 1 1 1
symmnumber: 1
zpe: 979577.7 jmol-1
zpe.correction: 0.373101 hartree
zpe.thermalcorrener: 0.393868 hartree
zpe.thermalcorrenthalpy: 0.394812 hartree
zpe.thermalcorrgfe: 0.319678 hartree
zpe.sumelectzpe: -690.545511 hartree
zpe.sumelectthermal: -690.524745 hartree
zpe.sumelectthermalent: -690.523801 hartree
zpe.sumelectthermalfe: -690.598934 hartree
dipole: 1.3119 -1.9956 1.1921
dipole: 2.6692
quadrupole: -89.7633 -89.2000 -96.3124
quadrupole: -18.9891 4.9477 -1.3283
quadrupole: 1.9952 2.5586 -4.5538 -18.9891 4.9477 -1.3283
hfenergy: -690.9186125 hartree
pointgroup: C01 [X(C12H26N4)]
dipole: -0.5072072 -0.7988995 -0.4552635 debye
polarizability: 194.7792975|31.94228|186.369184|4.9022727|4.2145637|136.225432 unknown
InChI: InChI=1S/C12H26N4/c1-2-3-4-5-6-7-8-9-10-11-15-16-12(13)14/h11H,2-10,13-14H2,1H3
charge 0 multiplicity 1
42 atoms
N  -4.001973 0.197254 -0.1279
N  -4.570372 -0.765622 0.76863
N  -5.28421 -1.764538 -1.304276
N  -5.661887 -2.834948 0.781684
C  2.01323 0.433158 -0.257898
C  3.488454 0.664549 0.139572
C  1.086721 1.615982 0.103783
C  4.413365 -0.519088 -0.223858
C  -0.388337 1.377719 -0.288686
C  5.889015 -0.291209 0.174262
C  -1.309691 2.564602 0.070176
C  6.812296 -1.475602 -0.192759
C  -2.796371 2.332413 -0.320683
C  8.284522 -1.241621 0.209664
C  -3.441484 1.220393 0.468205
C  -5.153115 -1.753837 0.072702
H  1.639631 -0.487321 0.237664
H  1.953421 0.242684 -1.350161
H  3.548116 0.853535 1.232104
H  3.861841 1.585904 -0.355142
H  1.457474 2.536898 -0.394276
H  1.148607 1.80804 1.195802
H  4.353895 -0.707317 -1.316606
H  4.038723 -1.440356 0.269941
H  -0.453772 1.183874 -1.379877
H  -0.76121 0.459953 0.209181
H  5.950583 -0.105767 1.267341
H  6.265004 0.630408 -0.317974
H  -0.945733 3.480392 -0.438563
H  -1.244518 2.764825 1.1602
H  6.75068 -1.659369 -1.28509
H  6.434888 -2.396002 0.298219
H  -2.876899 2.100338 -1.399498
H  -3.358673 3.273824 -0.143014
H  8.37661 -1.085484 1.301304
H  8.92255 -2.102512 -0.063365
H  8.694572 -0.344414 -0.291818
H  -3.426483 1.289238 1.572659
H  -5.452188 -2.622185 -1.822654
H  -4.841718 -0.95811 -1.755047
H  -6.419591 -3.395298 0.399385
H  -5.543475 -2.79548 1.792167
