program: Gaussian 09
title: 000249138
version: EM64L-G09RevD.01
frameworkgroup: C1[X(C8H9FN4)]
method: RPBEPBE
basis: SDD
operation: Freq
keyword: #pfreq=noraman
keyword: PBEPBE/SDD
title: #p freq=noraman PBEPBE/SDD
converged: NO YES NO NO
title: Mulliken charges:
elementType: F N N N N C C C C C C C C H H H H H H H H H
charge: -0.208728 -0.132689 -0.156225 -0.622705 -0.621107 0.446010 -0.351668 -0.343050 -0.367683 -0.360312 0.316028 -0.386030 0.260766 0.231973 0.251859 0.252975 0.250680 0.230628 0.310808 0.336563 0.356500 0.305407
chargesum: 0.00000
title: Mulliken charges with hydrogens summed into heavy atoms:
elementType: F N N N N C C C C C C C C
charge: -0.208728 -0.132689 -0.156225 0.024666 0.040800 0.446010 -0.119695 -0.091191 -0.114708 -0.109632 0.316028 -0.155403 0.260766
polarizability: 2.71574748e+02 1.03352636e+01 1.16623037e+02 -6.34535559e-01 1.04545188e-01 4.73344082e+01
1716.lowfreq: -0.0007 -0.0006 0.0005 3.4709 5.3720 11.1198 39.3869 58.0529 70.0121
frequency: 39.0510 58.0289 69.9989 132.4288 178.1902 201.6747 221.5289 263.4629 311.3208 362.8128 395.2215 407.8928 418.0814 437.0962 440.0551 516.5730 525.8016 544.0474 620.5926 634.8601 658.2247 715.5428 723.4255 762.2024 815.4747 836.9998 845.2839 933.3322 937.1013 960.3950 966.5697 1000.8643 1007.6460 1049.2097 1100.0324 1126.2387 1151.5629 1191.9090 1236.5333 1289.3107 1340.8688 1377.4567 1410.3611 1490.7118 1498.7270 1512.3276 1578.5039 1589.2443 1596.6282 1610.7310 1628.1856 3033.3080 3133.4686 3153.6270 3172.5625 3175.9688 3488.3899 3554.7786 3676.0331 3706.3296
redmass: 4.1270 5.9985 5.4497 6.3632 1.4266 4.0012 3.5561 6.3705 2.8695 6.1621 3.6363 1.4312 3.1959 2.4992 4.2673 1.4501 1.8739 4.8010 5.4658 2.7473 4.2981 1.8268 3.2862 5.6676 1.2620 1.5357 4.9814 1.3969 4.1633 1.4817 1.3663 2.7225 1.8757 1.9195 1.3488 2.7819 1.3730 2.0867 2.1589 1.3369 2.1336 3.9522 4.3249 2.5384 2.2643 3.7190 3.6337 1.9084 4.5095 6.1016 1.6384 1.0877 1.0895 1.0878 1.0957 1.0971 1.0482 1.0451 1.0996 1.1042
irintensity: 2.0727 1.0615 0.8091 18.4598 78.2798 13.4030 12.2233 2.5108 23.5928 14.0506 48.9355 276.3985 0.2975 43.0020 9.5965 132.1785 9.9570 24.8606 3.4835 20.3711 14.3238 112.6614 28.1046 11.4094 4.2613 73.3080 24.8775 17.7832 64.5875 19.0840 2.7901 4.1105 2.4844 3.6866 19.6360 102.9509 43.0952 51.3004 28.9947 6.4085 18.6162 8.1838 3.7553 195.9645 27.1685 668.9028 13.4163 389.4225 20.5882 22.3501 633.3311 28.1461 11.6197 4.0930 9.1593 6.2332 27.7029 107.6933 71.9590 37.2725
temp: 298.150 k
press: 1.00000 atm
elementType: 9 7 7 7 7 6 6 6 6 6 6 6 6 1 1 1 1 1 1 1 1 1
symmnumber: 1
zpe: 435529.2 jmol-1
zpe.correction: 0.165884 hartree
zpe.thermalcorrener: 0.178210 hartree
zpe.thermalcorrenthalpy: 0.179154 hartree
zpe.thermalcorrgfe: 0.126640 hartree
zpe.sumelectzpe: -628.138989 hartree
zpe.sumelectthermal: -628.126663 hartree
zpe.sumelectthermalent: -628.125719 hartree
zpe.sumelectthermalfe: -628.178233 hartree
dipole: 5.7484 1.3538 0.0738
dipole: 5.9062
quadrupole: -54.6315 -63.0626 -80.9746
quadrupole: 11.7246 0.7665 -0.5600
quadrupole: 11.5914 3.1603 -14.7517 11.7246 0.7665 -0.5600
hfenergy: -628.3048736 hartree
pointgroup: C01 [X(C8H9F1N4)]
dipole: 2.2561382 0.5557736 0.0186123 debye
dipolederiv: -1.4179179 0.2238741 -0.0009661 0.3451226 -0.2765235 0.0023324 -0.0035556 0.0024161 -0.1503563 1.1463331 0.1549865 -0.0064115 -0.3467133 -0.3556639 0.0027479 -0.0192672 0.0012288 -0.1584341 -2.3862309 -0.3072979 0.0075243 -0.4263137 -0.4648572 -0.0021028 -0.0357926 0.0088957 -0.2746005 -1.976233 0.1671666 0.1260898 0.2819999 -0.3255491 0.0717175 0.3685527 0.0735496 -0.709851 -0.4368871 0.027463 -0.0725899 -0.6359102 -1.1682184 -0.0930581 -0.1611375 -0.162708 -0.645474 0.5362411 0.0085727 -0.0011147 -0.0940335 -0.1761177 0.0049872 0.0036242 0.0034575 0.0207402 -0.1218389 0.0082261 -0.0012364 -0.080253 0.1180422 -0.0082316 0.000413 -0.0082462 -0.1750228 -0.0689229 -0.0249934 -0.0015683 0.1620298 0.0539947 -0.0073558 -0.0061755 -0.0047712 -0.1403503 -0.0774595 0.0361829 -0.0014036 0.28967 -0.0812378 -0.0030938 -0.0102137 -0.0024079 -0.1555483 -0.260706 0.0477779 -0.0009301 -0.2063726 0.0309474 -0.0045154 0.0076713 -0.0057459 -0.1559639 1.3165025 -0.2444373 0.0007629 -0.277513 0.31115 -0.0056895 0.0021401 -0.0055533 0.0714928 -0.2514829 -0.0930481 0.0008226 -0.4715056 0.3084487 -0.0059595 0.0195068 -0.0091571 -0.1024692 2.8392089 0.0413428 -0.0637404 1.3986695 1.4393417 0.0491808 -0.0690012 0.0142393 0.23059 0.0830424 0.0737726 -0.001541 0.0406597 -0.0821454 0.0069062 -0.0005322 0.0064495 0.1554666 0.0422969 -0.1006069 0.0040062 -0.0717083 0.0154078 0.0044258 0.0024582 0.0034152 0.147105 -0.0141118 -0.077459 0.0032457 -0.091059 0.0358151 0.0046891 0.0040304 0.0045638 0.1823938 0.0634946 0.0421267 -0.0007859 0.0721867 -0.0447329 0.0063085 -0.0013938 0.0063499 0.1783386 0.0138264 0.0010716 0.0011882 0.0437886 -0.1388386 0.0068542 -0.0006705 0.0071736 0.173008 0.25726 -0.0166841 -0.0251056 0.0390311 0.153496 -0.051821 -0.1865251 -0.0589453 0.3825153 0.273268 -0.0453424 -0.0197326 -0.1040484 0.1810493 -0.0087274 -0.0548494 0.0063732 0.3863595 0.2647662 0.0840497 0.0089734 0.1282257 0.2668091 0.0174604 0.0325568 0.0433204 0.3419617 0.1755508 -0.006744 0.0445127 0.004047 0.1993826 0.0129449 0.1081608 0.0761024 0.3980989 unknown
polarizability: 271.3453718|11.893683|116.842995|-1.2294627|-0.6358676|47.343827 unknown
InChI: InChI=1S/C8H9FN4/c9-7-3-1-6(2-4-7)5-12-13-8(10)11/h1-5H,10-11H2
charge 0 multiplicity 1
22 atoms
F  -4.839237 0.68951 -0.004087
N  1.628882 -0.068554 -0.01073
N  2.899203 -0.687627 -0.001572
N  5.182046 -0.224823 -0.075602
N  3.657908 1.595173 0.052734
C  -0.777962 -0.471292 0.007065
C  -1.815586 -1.447075 0.040585
C  -1.142038 0.907908 -0.031561
C  -3.175134 -1.071523 0.037335
C  -2.493206 1.300663 -0.035016
C  -3.483087 0.298815 -0.000182
C  0.618727 -0.91705 0.012592
C  3.880729 0.237238 -0.007456
H  -1.551718 -2.510849 0.070098
H  -0.34683 1.658858 -0.05924
H  -3.978397 -1.813552 0.063253
H  -2.786921 2.354351 -0.064452
H  0.81328 -2.003676 0.036335
H  5.976419 0.362361 0.16086
H  5.299175 -1.234712 -0.120648
H  2.666302 1.847371 0.071936
H  4.374244 2.288086 -0.141046
