program: Gaussian 09
title: 000249136
version: EM64L-G09RevD.01
frameworkgroup: C1[X(C16H14N4)]
method: RPBEPBE
basis: SDD
operation: Freq
keyword: #pfreq=noraman
keyword: PBEPBE/SDD
title: #p freq=noraman PBEPBE/SDD
converged: YES YES NO NO
title: Mulliken charges:
elementType: N N N N C C C C C C C C C C C C C C C C H H H H H H H H H H H H H H
charge: -0.151996 -0.148939 -0.622108 -0.627307 0.199599 0.190492 0.143748 0.460169 0.455295 -0.791857 -0.355800 -0.367765 -0.463237 -0.452415 -0.381598 -0.265986 -0.257813 -0.249458 -0.252416 0.260240 0.242351 0.280915 0.228414 0.241849 0.242577 0.223123 0.221830 0.225657 0.226156 0.228256 0.335775 0.309951 0.305437 0.366859
chargesum: 0.00000
title: Mulliken charges with hydrogens summed into heavy atoms:
elementType: N N N N C C C C C C C C C C C C C C C C
charge: -0.151996 -0.148939 0.023618 0.044989 0.199599 0.190492 0.143748 0.460169 0.455295 -0.549506 -0.074885 -0.139350 -0.221388 -0.209838 -0.158474 -0.044156 -0.032157 -0.023301 -0.024160 0.260240
polarizability: 3.95034807e+02 1.20007838e+01 2.97669780e+02 -3.76946950e+00 6.04096268e+00 8.67549720e+01
1716.lowfreq: -5.5040 -0.0006 -0.0006 -0.0004 3.4362 7.9443 33.5038 45.2168 59.7584
frequency: 33.4996 45.2005 59.7527 84.0049 109.0524 140.1110 155.4036 206.1434 215.0135 234.6230 244.2271 281.2450 299.2733 344.7378 384.9541 388.6019 416.3135 418.7804 425.1388 451.7399 473.8710 504.3463 526.5492 542.3727 565.4075 599.8451 614.8558 623.4397 637.4094 642.6045 664.0688 707.1401 714.8976 747.6643 756.7328 770.2300 813.5057 842.6585 857.8099 869.4547 873.3669 906.2188 929.6240 939.7466 944.9255 963.6868 975.2596 988.3593 994.6084 1009.0341 1026.8771 1031.5143 1048.1766 1065.8490 1103.4184 1134.8210 1167.3916 1170.0472 1185.9226 1200.2045 1253.2261 1272.5224 1290.5225 1319.9422 1357.5964 1372.1753 1388.9879 1415.5272 1436.4625 1441.7934 1447.7709 1485.3480 1494.2540 1500.9380 1530.5485 1561.5046 1572.3945 1580.5071 1588.5500 1623.5742 1625.9588 1630.8332 3056.2719 3115.9917 3118.3234 3120.4733 3129.2737 3133.0273 3153.0920 3153.7460 3168.9042 3172.0250 3490.7672 3549.8056 3673.3777 3700.3724
redmass: 4.2609 4.1783 4.8667 4.8788 3.7222 5.2755 3.9461 3.3297 2.2620 2.6347 3.9884 3.9333 2.8621 3.6437 5.1282 5.4520 1.3027 3.4584 5.2120 2.4382 2.7982 3.4709 1.1969 4.5304 3.2698 6.0952 4.0518 4.2478 3.1058 3.9211 4.5742 1.9552 4.0399 1.2958 3.1929 1.3468 2.0678 4.2794 1.6363 4.1928 1.5958 4.8670 1.9638 1.9701 3.8984 1.3944 1.4183 1.3582 1.3440 2.0903 2.2179 2.0885 2.0887 3.3489 2.2438 2.5230 1.2983 1.1299 1.2306 1.3095 1.6118 2.1422 1.8077 2.6642 2.8692 2.2131 1.7688 4.7910 9.0773 2.5458 2.2337 2.5400 3.4178 2.8438 5.3825 5.7408 3.5967 5.3144 1.7318 3.1719 1.9585 5.4328 1.0855 1.0897 1.0864 1.0868 1.0905 1.0891 1.0975 1.0955 1.0976 1.0956 1.0478 1.0450 1.1001 1.1041
irintensity: 2.1745 0.8882 1.5212 3.7055 0.2578 3.3393 13.5037 52.6108 47.2915 22.8792 1.7064 7.9801 37.2130 31.7613 6.1481 8.4585 291.8686 10.6768 7.5654 23.4953 0.0444 0.0949 123.4608 10.1206 10.0987 7.9044 2.3997 5.9683 49.8631 11.9796 1.7400 131.2494 8.0551 103.4361 1.6192 1.7700 17.6696 2.3350 27.0059 17.9618 2.9761 27.3391 20.7349 29.1072 35.5188 4.3694 10.0463 1.2841 1.0167 8.2762 2.8865 8.0728 1.2865 43.1515 1.0353 89.4273 43.8068 0.9687 2.9602 3.2892 6.1743 0.6291 0.0387 4.9833 10.4174 5.9287 2.7441 1.7954 0.5926 3.2070 9.5018 102.7580 444.6159 181.6879 81.9859 40.6813 104.8901 3.1605 405.7136 193.4334 452.0101 67.5192 21.7037 1.9965 0.3883 4.2775 24.1382 14.7323 40.1022 37.0159 36.8154 20.8926 27.6842 113.3358 76.2469 33.7083
temp: 298.150 k
press: 1.00000 atm
elementType: 7 7 7 7 6 6 6 6 6 6 6 6 6 6 6 6 6 6 6 6 1 1 1 1 1 1 1 1 1 1 1 1 1 1
symmnumber: 1
zpe: 699804.2 jmol-1
zpe.correction: 0.266541 hartree
zpe.thermalcorrener: 0.283283 hartree
zpe.thermalcorrenthalpy: 0.284227 hartree
zpe.thermalcorrgfe: 0.221831 hartree
zpe.sumelectzpe: -835.726546 hartree
zpe.sumelectthermal: -835.709804 hartree
zpe.sumelectthermalent: -835.708860 hartree
zpe.sumelectthermalfe: -835.771256 hartree
dipole: 4.0737 0.3654 1.1318
dipole: 4.2438
quadrupole: -66.6608 -102.4225 -123.8882
quadrupole: -1.0246 4.3216 2.2856
quadrupole: 30.9964 -4.7654 -26.2310 -1.0246 4.3216 2.2856
hfenergy: -835.993087 hartree
pointgroup: C01 [X(C16H14N4)]
dipole: -1.4888874 0.5630162 -0.5038749 debye
polarizability: 378.6290421|-39.2875987|308.290507|-4.9114214|-35.1692123|92.5400098 unknown
InChI: InChI=1S/C16H14N4/c17-16(18)20-19-10-15-13-7-3-1-5-11(13)9-12-6-2-4-8-14(12)15/h1-10H,17-18H2
charge 0 multiplicity 1
34 atoms
N  -2.32853 0.198688 -0.003638
N  -3.610579 -0.250812 0.396439
N  -5.87939 0.27209 0.235954
N  -4.335863 1.501459 -1.087432
C  0.644873 0.956662 -0.071292
C  0.962331 -1.503658 0.205764
C  0.083209 -0.354433 0.163612
C  2.084347 1.099564 -0.272693
C  2.399537 -1.328511 0.022841
C  2.922185 -0.037845 -0.217746
C  -0.142797 2.164937 -0.077293
C  0.488041 -2.855085 0.389371
C  2.647672 2.404973 -0.511132
C  3.274888 -2.472868 0.071854
C  -1.345371 -0.587202 0.409409
C  0.436716 3.413392 -0.296858
C  1.360589 -3.940727 0.429911
C  1.846669 3.540252 -0.531771
C  2.775003 -3.752555 0.277789
C  -4.574332 0.512902 -0.156606
H  4.00271 0.084279 -0.366094
H  -1.217452 2.075952 0.093276
H  -0.584038 -3.049336 0.478246
H  3.730211 2.48243 -0.66925
H  4.350938 -2.308955 -0.062372
H  -1.624934 -1.48737 0.978632
H  -0.189607 4.312963 -0.283526
H  0.962771 -4.951971 0.570944
H  2.28472 4.528381 -0.71123
H  3.447585 -4.616386 0.31401
H  -6.010684 -0.4557 0.935369
H  -6.67128 0.574181 -0.324834
H  -5.02616 2.202413 -1.339764
H  -3.347276 1.624898 -1.320693
