program: Gaussian 09
title: 000249134
version: EM64L-G09RevD.01
frameworkgroup: C1[X(C14H14N4)]
method: RPBEPBE
basis: SDD
operation: Freq
keyword: #pfreq=noraman
keyword: PBEPBE/SDD
title: #p freq=noraman PBEPBE/SDD
converged: YES YES NO NO
title: Mulliken charges:
elementType: N N N N C C C C C C C C C C C C C C H H H H H H H H H H H H H H
charge: -0.163975 -0.162736 -0.624327 -0.625479 0.315134 0.317634 -0.043050 -0.380271 -0.344587 -0.398546 -0.383162 -0.233805 -0.251938 -0.231053 -0.235833 -0.248583 -0.243248 0.263321 0.255676 0.259669 0.250035 0.256129 0.223690 0.221299 0.221071 0.223725 0.225395 0.224949 0.309202 0.337033 0.363598 0.303032
chargesum: 0.00000
title: Mulliken charges with hydrogens summed into heavy atoms:
elementType: N N N N C C C C C C C C C C C C C C
charge: -0.163975 -0.162736 0.021908 0.041151 0.315134 0.317634 -0.043050 -0.124595 -0.084917 -0.148511 -0.127033 -0.010115 -0.030639 -0.009982 -0.012108 -0.023188 -0.018299 0.263321
polarizability: 2.75379992e+02 1.59483892e+01 2.39163056e+02 7.42019743e+00 -7.07344681e+00 9.88423039e+01
1716.lowfreq: -7.5133 -6.1385 -3.2324 0.0005 0.0005 0.0006 29.8941 50.2485 63.5374
frequency: 29.7128 50.2390 63.5275 68.9282 77.3972 86.1524 160.8953 196.9764 220.4137 225.4886 254.2040 282.6743 303.4601 375.2454 400.2267 408.9642 410.6636 444.2860 453.3259 493.4496 518.0183 525.6088 612.5446 615.5461 625.6840 643.0639 649.8581 654.3660 696.0942 701.4711 719.5837 741.8273 781.8980 784.9368 845.6343 854.7319 891.4398 920.6564 927.0909 964.2759 971.3011 980.4027 988.0683 989.2880 991.0509 992.7607 1005.6226 1025.7619 1030.0358 1049.9237 1081.3112 1082.4818 1114.3028 1169.3962 1171.0283 1184.0119 1187.9186 1194.4474 1295.7731 1315.0048 1328.2187 1373.9603 1378.9484 1427.3381 1430.9813 1474.6432 1476.6609 1492.2789 1494.5739 1550.0326 1578.7399 1582.6764 1584.0106 1605.3216 1609.4922 1621.9738 3119.5970 3119.8339 3129.0476 3129.7942 3143.4864 3145.5005 3154.5674 3158.3467 3164.6741 3182.6466 3467.5162 3552.4644 3670.9970 3705.0648
redmass: 3.9479 4.5039 4.1581 4.7517 4.8605 4.3510 4.2902 1.7048 4.6164 2.3983 3.7670 5.0177 4.6042 3.6463 2.8026 2.2794 1.5866 3.1132 2.9774 4.2172 3.4273 1.2376 6.2577 6.1562 4.0152 2.9226 4.3506 5.1308 1.6347 1.7945 1.6467 3.0040 2.4138 2.5037 1.2546 1.2478 5.0933 1.5555 1.4320 4.2144 1.3948 1.4210 5.2698 4.5741 1.4183 1.3279 2.0231 2.2632 2.0140 2.0546 1.5964 1.6393 2.6579 1.0542 1.0536 2.2367 1.4126 1.1207 2.7138 1.3913 1.5388 6.9521 7.6119 2.4512 2.2943 2.5402 2.3467 3.4445 2.2671 3.1576 5.6835 1.9157 5.6292 5.9400 5.6264 1.4711 1.0844 1.0844 1.0883 1.0886 1.0940 1.0927 1.0953 1.0995 1.1004 1.0955 1.0496 1.0450 1.0979 1.1043
irintensity: 0.4645 4.2416 0.7559 3.6576 0.7464 2.6666 10.1561 62.0708 7.1100 30.5236 20.3917 1.2768 3.2402 65.3675 0.1987 68.3698 221.4176 14.0982 24.9157 5.2053 10.2254 80.9784 0.4536 0.1575 6.1194 55.2965 14.7014 10.1369 66.5445 29.6788 154.0760 8.5217 27.1232 34.0215 1.3156 0.3124 26.8881 9.0895 1.9329 50.5217 1.0204 1.1970 0.5981 0.1902 0.5722 0.1321 2.0283 7.2198 13.7231 11.0292 7.5498 15.4586 62.4194 0.1991 0.3095 21.7796 10.6509 2.6739 27.2135 9.8701 12.7434 2.1292 1.8654 57.6209 12.1204 87.4453 133.5862 117.5090 97.2904 272.3655 4.5504 482.6083 6.7977 3.7460 19.5140 575.3052 2.2785 1.2556 6.9716 11.1762 55.9862 13.5150 27.1190 38.1357 21.3649 5.6013 34.8799 83.4728 74.8179 34.8241
temp: 298.150 k
press: 1.00000 atm
elementType: 7 7 7 7 6 6 6 6 6 6 6 6 6 6 6 6 6 6 1 1 1 1 1 1 1 1 1 1 1 1 1 1
symmnumber: 1
zpe: 666043.9 jmol-1
zpe.correction: 0.253683 hartree
zpe.thermalcorrener: 0.269787 hartree
zpe.thermalcorrenthalpy: 0.270732 hartree
zpe.thermalcorrgfe: 0.209065 hartree
zpe.sumelectzpe: -759.613786 hartree
zpe.sumelectthermal: -759.597681 hartree
zpe.sumelectthermalent: -759.596737 hartree
zpe.sumelectthermalfe: -759.658404 hartree
dipole: -3.2117 -2.6974 -0.1872
dipole: 4.1984
quadrupole: -77.1403 -82.8749 -109.2626
quadrupole: 12.4414 2.9708 -1.6727
quadrupole: 12.6189 6.8844 -19.5033 12.4414 2.9708 -1.6727
hfenergy: -759.8674683 hartree
pointgroup: C01 [X(C14H14N4)]
dipole: -1.0346391 -1.2593673 -0.2679951 debye
polarizability: 264.7866615|20.0666066|245.9113482|27.456032|6.314042|102.6873423 unknown
InChI: InChI=1S/C14H14N4/c15-14(16)18-17-13(11-7-3-1-4-8-11)12-9-5-2-6-10-12/h1-10H,15-16H2
charge 0 multiplicity 1
32 atoms
N  -0.674206 -1.338073 -0.154288
N  -2.081539 -1.26864 -0.210757
N  -3.973449 -2.623933 -0.35941
N  -1.833157 -3.618804 -0.658428
C  1.485502 -0.363315 0.107774
C  -0.590576 1.170847 0.050645
C  0.004499 -0.201503 -0.011461
C  2.378338 0.644331 -0.354459
C  -1.659978 1.568604 -0.799429
C  2.04083 -1.552461 0.661052
C  -0.086191 2.11754 0.987079
C  3.776546 0.465239 -0.27314
C  -2.191954 2.873236 -0.724882
C  3.436721 -1.728802 0.745121
C  -0.632026 3.416292 1.074361
C  4.314538 -0.720931 0.277073
C  -1.685813 3.802727 0.214158
C  -2.597102 -2.500499 -0.408462
H  1.973685 1.562362 -0.793613
H  -2.068739 0.847827 -1.51104
H  1.355835 -2.322796 1.029188
H  0.730515 1.826844 1.65713
H  4.445744 1.250159 -0.643915
H  -3.007701 3.164461 -1.396741
H  3.84408 -2.647442 1.183445
H  -0.23465 4.124573 1.810391
H  5.399879 -0.857179 0.344634
H  -2.106765 4.812958 0.274629
H  -4.458132 -3.428946 -0.745019
H  -4.493668 -1.775098 -0.148182
H  -0.825678 -3.431291 -0.638996
H  -2.197188 -4.565589 -0.613859
