program: Gaussian 09
title: 000249133
version: EM64L-G09RevD.01
frameworkgroup: C1[X(C7H16N8)]
method: RPBEPBE
basis: SDD
operation: Freq
keyword: #pfreq=noraman
keyword: PBEPBE/SDD
title: #p freq=noraman PBEPBE/SDD
converged: NO YES NO NO
title: Mulliken charges:
elementType: N N N N N N N N C C C C C C C H H H H H H H H H H H H H H H H
charge: -0.138605 -0.138453 -0.174837 -0.174428 -0.626324 -0.625590 -0.626461 -0.625482 -0.585858 0.172685 0.172248 -0.773626 -0.773150 0.241367 0.241206 0.217060 0.216817 0.236820 0.232369 0.254200 0.253896 0.236516 0.232548 0.302370 0.326102 0.297819 0.351279 0.326095 0.302368 0.351218 0.297834
chargesum: 0.00000
title: Mulliken charges with hydrogens summed into heavy atoms:
elementType: N N N N N N N N C C C C C C C
charge: -0.138605 -0.138453 -0.174837 -0.174428 0.002147 0.023508 0.002002 0.023569 -0.151982 0.172685 0.172248 -0.050237 -0.050190 0.241367 0.241206
polarizability: 2.78568122e+02 3.06921093e+01 1.16635671e+02 -1.34943509e-02 -1.61385652e-04 9.97815303e+01
1716.lowfreq: -40.7165 -32.6243 -0.0004 -0.0003 0.0004 3.4534 5.7134 13.2301 20.4803
frequency: -40.3557 -31.8088 20.3313 33.0773 55.6017 74.1957 96.9859 109.0991 117.8878 159.4587 163.6717 252.8314 254.6988 267.0988 291.4613 305.5207 348.3553 361.0971 376.4429 405.2537 406.5426 428.8447 461.1709 504.9276 509.2481 529.3592 530.3549 561.0164 584.7994 609.3115 637.8234 638.4522 657.0941 726.6736 727.7921 819.9566 841.1854 891.9684 910.5935 940.9315 980.5790 990.5588 1001.3758 1016.8465 1038.5851 1043.0737 1049.8518 1063.4605 1116.8285 1128.7862 1184.0649 1255.4633 1272.9625 1281.0231 1380.9785 1381.3303 1437.4327 1449.4606 1450.7777 1459.9876 1461.6062 1482.6747 1483.1053 1531.4873 1536.4911 1586.6862 1591.8429 1594.4057 1606.2089 1625.1231 1632.8667 2976.2942 2976.5883 2985.9235 3056.4129 3061.1324 3061.7465 3103.8397 3103.9577 3470.6351 3471.4990 3543.2765 3543.4410 3662.7504 3662.9048 3692.4904 3692.6339
redmass: 1.0998 1.1429 4.1632 3.3214 4.0570 3.6763 3.5269 3.9270 5.3565 4.9943 3.2337 2.5270 1.3526 1.5195 2.4655 2.3970 3.6155 3.8207 1.7282 1.2736 1.5042 1.8099 2.3294 3.3864 2.6597 1.4033 1.2873 3.1436 4.4187 3.6869 2.4364 2.4369 3.2652 1.6662 1.6517 3.7499 3.1467 2.7716 6.3849 2.7469 1.8439 2.1717 1.9624 1.5250 1.6200 1.5199 1.6075 1.9384 2.1604 2.8186 1.4785 2.3012 2.9596 1.8911 1.2333 1.2364 1.0924 1.0680 1.0663 1.1120 1.0925 2.5648 2.5734 2.2824 2.0279 2.0065 1.7332 3.2221 3.3291 1.5826 1.9404 1.0395 1.0391 1.0570 1.1026 1.0917 1.0916 1.1015 1.1016 1.0486 1.0486 1.0448 1.0449 1.0982 1.0983 1.1034 1.1034
irintensity: 0.8557 0.7682 2.3701 2.5402 0.3027 2.7914 8.3036 1.4507 8.7524 11.7593 14.2548 1.5496 244.8340 0.2350 69.0432 0.3987 67.3557 22.2202 28.6356 352.2010 80.1480 83.1832 16.1919 23.8167 31.2531 94.5541 197.4484 7.1938 1.4098 18.2077 54.2928 38.1642 5.5277 91.5398 213.9955 0.1249 1.0051 39.6233 2.6298 49.9357 0.6558 2.0519 0.6566 5.9850 0.7251 4.9688 1.9404 42.5422 0.0528 111.0022 14.1100 21.5655 3.4634 26.1818 58.2523 18.5086 22.0658 14.3680 4.2868 13.1709 6.7476 29.9626 47.6202 525.8093 88.1439 803.0548 101.4356 63.5812 0.7742 1146.7654 32.8474 7.3293 32.4209 25.9364 18.1606 15.6896 18.9329 2.9229 15.6062 45.5684 40.0146 66.2470 28.5133 102.2161 12.4071 25.0694 23.9765
temp: 298.150 k
press: 1.00000 atm
elementType: 7 7 7 7 7 7 7 7 6 6 6 6 6 6 6 1 1 1 1 1 1 1 1 1 1 1 1 1 1 1 1
symmnumber: 1
zpe: 662686.7 jmol-1
zpe.correction: 0.252404 hartree
zpe.thermalcorrener: 0.269195 hartree
zpe.thermalcorrenthalpy: 0.270140 hartree
zpe.thermalcorrgfe: 0.206927 hartree
zpe.sumelectzpe: -713.148229 hartree
zpe.sumelectthermal: -713.131438 hartree
zpe.sumelectthermalent: -713.130494 hartree
zpe.sumelectthermalfe: -713.193706 hartree
dipole: 0.0015 -0.0052 -0.2454
dipole: 0.2454
quadrupole: -30.5704 -83.4231 -91.0835
quadrupole: 10.9562 0.0313 -0.0032
quadrupole: 37.7886 -15.0641 -22.7245 10.9562 0.0313 -0.0032
hfenergy: -713.4006335 hartree
pointgroup: C01 [X(C7H16N8)]
dipole: 0.0001123 0.003359 -0.0965056 debye
polarizability: 277.3978902|33.6056653|117.7646838|0.9241122|0.8254511|99.8227492 unknown
InChI: InChI=1S/C7H16N8/c1-4(12-14-6(8)9)3-5(2)13-15-7(10)11/h3,8-11H2,1-2H3
charge 0 multiplicity 1
31 atoms
N  2.270273 0.011664 0.396148
N  -2.272607 -0.05071 0.418334
N  3.282099 -0.541237 -0.457688
N  -3.293165 0.591141 -0.359493
N  5.485173 -0.1737 -1.156715
N  4.613125 1.162336 0.602695
N  -5.502463 0.298945 -1.074082
N  -4.613991 -1.220248 0.520273
C  0.003646 -0.065103 1.25444
C  1.113232 -0.617975 0.366276
C  -1.116141 0.580149 0.445164
C  0.811718 -1.835046 -0.482523
C  -0.824601 1.882908 -0.269509
C  4.423312 0.150796 -0.321323
C  -4.432642 -0.113254 -0.288951
H  0.449703 0.683158 1.936725
H  -0.434714 -0.883553 1.856448
H  -0.277136 -1.969183 -0.595069
H  1.233939 -2.744986 -0.011779
H  1.290886 -1.7465 -1.472422
H  -1.307657 1.897673 -1.26137
H  0.262991 2.034641 -0.371474
H  -1.250269 2.734696 0.297097
H  6.444235 0.016262 -0.876889
H  5.307863 -0.919576 -1.826544
H  5.354022 1.851078 0.506618
H  3.76679 1.372713 1.140744
H  -5.33188 1.113617 -1.660317
H  -6.458765 0.078261 -0.807628
H  -3.763338 -1.487578 1.025086
H  -5.354838 -1.895586 0.354122
