program: Gaussian 09
title: 000249129
version: EM64L-G09RevD.01
frameworkgroup: C1[X(C6H12OS2)]
method: RPBEPBE
basis: SDD
operation: Freq
keyword: #p
keyword: freq=noraman
keyword: PBEPBE/SDD
title: #p freq=noraman PBEPBE/SDD
converged: YES YES NO NO
title: Mulliken charges:
elementType: S S O C C C C C C H H H H H H H H H H H H
charge: 0.567891 -0.002076 -0.559792 -0.386787 -0.375903 -0.315556 -0.439658 -0.674318 -0.660942 0.217087 0.222612 0.313290 0.222937 0.203306 0.264590 0.223651 0.270743 0.219359 0.243379 0.230254 0.215933
chargesum: 0.00000
title: Mulliken charges with hydrogens summed into heavy atoms:
elementType: S S O C C C C C C
charge: 0.567891 -0.002076 -0.559792 0.052911 -0.062613 0.110687 -0.175068 0.039435 0.028624
polarizability: 1.53350202e+02 4.15880486e+00 1.09305875e+02 -7.95307940e-01 3.20727510e+00 7.39034103e+01
1716.lowfreq: -10.5721 0.0019 0.0023 0.0035 7.9825 17.8025 57.6986 85.1107 175.2827
frequency: 57.6035 85.0493 175.2813 196.4641 203.8265 219.9133 228.3776 236.2153 272.4810 290.9675 323.1736 358.6359 375.5822 416.8506 503.4605 537.6514 586.8610 803.9680 828.3250 852.8882 919.1588 922.9164 989.7192 1012.5092 1041.2298 1073.0072 1080.9095 1087.6470 1143.2013 1166.5990 1206.7971 1249.2859 1265.0618 1287.6882 1297.2460 1348.5716 1355.6256 1388.0701 1388.9418 1446.2925 1451.4858 1464.6241 1465.8074 1475.9767 1480.5596 2956.7961 2967.3489 2977.5300 2978.6014 3001.5373 3010.3383 3038.1641 3051.8892 3072.7911 3073.1451 3091.1282 3094.2128
redmass: 5.5178 2.9609 8.4144 4.4606 4.0456 1.1466 2.5375 1.2039 2.1427 5.1369 3.6349 3.5848 2.6458 5.7851 2.7089 2.9774 3.7744 2.2326 1.9385 16.2904 1.3314 1.6500 1.3091 2.0517 2.0495 1.5469 1.5059 2.6718 2.1485 1.5495 1.3082 1.2644 1.2690 1.3167 1.1872 1.4927 1.5094 1.1937 1.1959 1.0835 1.0775 1.0443 1.0472 1.0483 1.0495 1.0605 1.0621 1.0360 1.0364 1.0855 1.0986 1.0982 1.0893 1.0984 1.0973 1.0996 1.1001
irintensity: 0.5797 0.6713 1.2849 2.7358 7.0728 0.5501 0.8258 0.2791 0.8502 4.3823 4.7205 1.9937 5.0373 10.8142 4.9840 1.6776 1.2333 2.7877 2.8845 68.5560 3.3063 5.4256 20.5269 14.8131 11.6258 2.5449 3.1880 3.0862 3.6897 7.4659 7.7767 9.4014 16.9165 1.0847 10.8198 0.6141 7.7422 2.2784 36.3197 10.0925 8.3527 9.3809 26.0925 7.6549 13.9294 20.0337 36.7302 34.0131 35.9404 7.4476 19.2652 31.2807 1.3674 21.1869 29.5129 11.3611 22.9540
temp: 298.150 k
press: 1.00000 atm
elementType: 16 16 8 6 6 6 6 6 6 1 1 1 1 1 1 1 1 1 1 1 1
symmnumber: 1
zpe: 447857.9 jmol-1
zpe.correction: 0.170580 hartree
zpe.thermalcorrener: 0.181788 hartree
zpe.thermalcorrenthalpy: 0.182732 hartree
zpe.thermalcorrgfe: 0.133855 hartree
zpe.sumelectzpe: -1106.383050 hartree
zpe.sumelectthermal: -1106.371843 hartree
zpe.sumelectthermalent: -1106.370898 hartree
zpe.sumelectthermalfe: -1106.419775 hartree
dipole: 2.2061 5.2940 1.1102
dipole: 5.8417
quadrupole: -71.6457 -75.0373 -69.6784
quadrupole: -5.7225 0.0821 -1.5751
quadrupole: 0.4747 -2.9168 2.4421 -5.7225 0.0821 -1.5751
hfenergy: -1106.5536301 hartree
pointgroup: C01 [X(C6H12O1S2)]
dipole: 0.9009625 2.0853301 0.3490803 debye
dipolederiv: 0.9233696 0.1903355 -0.2419618 0.208397 0.3820128 -0.2420561 -0.0518453 -0.0383857 0.2094795 -0.5534902 -0.10705 -0.0143055 0.0654216 -0.2416753 0.0489357 0.1982501 0.0432894 -0.1877807 -0.6973652 -0.1753316 0.2064824 -0.2463353 -0.4972186 0.1943301 -0.2048832 -0.0783338 -0.2764343 -0.0513484 0.0896965 -0.0193755 0.0366612 -0.0412826 -0.0038787 -0.0182974 0.0965039 0.1119817 0.0834819 -0.0470555 0.0218245 -0.1429863 0.293712 -0.0477163 0.1310971 -0.0774262 0.0509457 -0.065555 -0.023852 -0.0118325 0.0049548 -0.008705 0.0238057 -0.0442261 -0.0429069 0.0934358 0.124357 0.1587678 0.0968928 0.3511537 0.3217171 0.0217132 0.223449 0.0739637 0.1364864 -0.0973855 -0.0545777 -0.0010679 0.0946906 -0.123585 0.0205316 -0.1049441 0.1097466 0.0730685 -0.060653 0.0452511 0.0293924 -0.2071187 -0.012355 0.0083407 -0.1343543 -0.0244028 0.0775128 0.0257758 -0.0178516 0.0165949 -0.0194443 0.1064053 0.0270917 0.0153284 -0.0558213 -0.1465258 0.0465207 0.0236467 -0.0164636 0.0683477 -0.1638417 0.0556056 -0.0206271 0.0604563 0.0770138 0.0212198 0.0155466 0.0444334 0.0135138 -0.0326606 -0.0329695 0.0006784 -0.0060645 -0.0463256 0.0557406 0.0307923 -0.0006296 0.0493815 0.0731008 -0.0321635 0.0268934 0.0311417 -0.1293882 -0.0473263 -0.1092108 -0.0375287 -0.1527931 -0.1116584 -0.0386351 -0.0453598 -0.0526628 0.0728456 0.0126211 -0.0178067 0.0460535 -0.0634553 -0.0129087 -0.0306748 -0.0255809 -0.0142885 -0.1402793 0.0511169 0.0713337 0.001781 0.0856537 -0.0695477 0.1081033 -0.0093782 0.0938262 0.0372426 0.0339424 -0.0425361 -0.0261083 -0.1598814 0.0571008 -0.037556 -0.0068463 -0.0379913 0.0946902 0.0861374 0.0074132 -0.0216641 0.0108982 0.0867786 -0.0417483 0.0650402 -0.0884706 -0.1212204 0.0815853 0.0547292 -0.0238466 0.129418 -0.0583459 0.069246 -0.0192915 0.0665885 0.0689574 0.1070996 -0.0036581 -0.024093 0.0250487 0.0978473 0.0084319 0.0625578 0.0133457 -0.1260632 -0.0798442 -0.0885826 -0.0245778 -0.1515263 -0.0448902 -0.0787372 -0.0376602 -0.0721078 0.0703573 unknown
polarizability: 152.9847398|4.0924847|109.3603021|-5.7172023|2.4023368|74.2144447 unknown
InChI: InChI=1S/C6H12OS2/c1-5(8)3-4-6(2)9-7/h5-6H,3-4H2,1-2H3
charge 0 multiplicity 1
21 atoms
S  -1.15142 -1.041548 0.685388
S  0.97609 -1.58058 -0.440356
O  -2.381058 -1.933208 0.041343
C  -0.177373 1.614267 0.218701
C  -1.294997 0.679499 -0.276374
C  1.256759 1.279321 -0.260677
C  1.857179 -0.037125 0.273498
C  -2.718701 1.192583 -0.039362
C  3.347883 -0.19106 -0.093927
H  -0.203285 1.67242 1.327552
H  -0.43335 2.632677 -0.138941
H  -1.143011 0.368016 -1.324463
H  1.284749 1.257135 -1.367747
H  1.924384 2.105932 0.062281
H  1.741657 -0.094439 1.373158
H  -2.901588 2.078735 -0.6761
H  -3.460871 0.419997 -0.306237
H  -2.879166 1.491725 1.013213
H  3.763892 -1.135041 0.298258
H  3.487814 -0.178842 -1.190129
H  3.92721 0.648533 0.335721
