program: Gaussian 09
title: 000249124
version: EM64L-G09RevD.01
frameworkgroup: C1[X(C7H14Cl2NOPS2)]
method: RPBEPBE
basis: SDD
operation: Freq
keyword: #p
keyword: freq=noraman
keyword: PBEPBE/SDD
title: #p freq=noraman PBEPBE/SDD
converged: YES YES NO NO
title: Mulliken charges:
elementType: Cl Cl S S P O N C C C C C C C H H H H H H H H H H H H H H
charge: -0.053247 -0.061591 0.060633 -0.208801 0.517875 -0.443553 -0.457436 -0.323408 -0.324481 -0.288603 -0.681895 -0.276624 -0.545035 -0.558801 0.245204 0.215055 0.281981 0.246362 0.265563 0.242374 0.282128 0.281225 0.224654 0.242003 0.286067 0.262034 0.310293 0.260025
chargesum: 0.00000
title: Mulliken charges with hydrogens summed into heavy atoms:
elementType: Cl Cl S S P O N C C C C C C C
charge: -0.053247 -0.061591 0.060633 -0.208801 0.517875 -0.443553 -0.457436 0.136851 0.203862 0.219334 -0.118542 0.190033 0.003066 0.011517
polarizability: 1.96005025e+02 -2.98962414e+00 1.72940304e+02 -1.12520676e+01 1.64568652e+01 1.34011373e+02
1716.lowfreq: -7.2435 -0.0015 -0.0013 0.0014 2.8009 7.2655 22.8281 34.3263 44.7461
frequency: 22.4848 34.2157 44.5041 57.0739 77.9717 93.2164 106.4623 118.3986 152.0561 161.3245 187.7429 201.0741 209.9737 225.2326 247.3692 279.3931 313.8945 325.9690 328.8315 370.7079 429.4093 466.5005 496.1808 540.0938 591.6244 649.2677 666.9748 694.5670 729.0471 775.9941 782.5849 816.2607 853.0613 895.6957 956.1807 971.7054 998.5216 1038.3179 1047.4271 1048.5440 1063.6783 1076.1453 1114.4154 1170.3305 1201.4829 1204.2157 1232.6833 1256.4941 1257.0831 1260.1356 1289.9064 1291.1624 1329.6182 1351.7924 1352.8431 1360.3808 1362.1816 1436.5587 1438.1964 1448.9604 1455.9154 1462.8348 1464.2875 1469.1610 2979.9047 2987.4968 3007.6545 3017.2446 3022.6976 3058.9842 3060.9742 3065.5215 3074.0128 3081.6779 3091.4207 3101.6207 3146.8378 3161.4776
redmass: 10.0723 18.5319 6.7226 8.7115 4.9660 2.3986 2.3818 4.4768 6.0602 4.5262 6.2430 6.1008 4.4528 7.3084 4.6240 4.2652 6.0475 4.4264 2.5105 5.4354 4.0693 6.4431 2.0824 10.4600 5.3718 10.7925 8.6247 5.4896 4.6343 1.1666 1.1680 2.6483 1.5641 2.6234 2.6541 2.7728 1.4649 2.0374 2.0085 2.7707 2.1239 2.1000 1.6721 1.2421 1.3243 2.0110 1.5855 1.1634 1.1521 1.1552 1.1628 1.1793 1.2178 1.2614 1.3492 1.2628 1.2499 1.0843 1.0877 1.0806 1.0900 1.0857 1.0859 1.0743 1.0636 1.0664 1.0600 1.0604 1.0604 1.0566 1.0955 1.0633 1.0989 1.1045 1.1009 1.1063 1.1123 1.1113
irintensity: 0.2215 0.6669 0.2595 0.3194 5.3690 1.7654 2.3235 3.0664 1.3334 2.4321 2.9535 0.5611 1.4643 4.2541 5.3579 16.3980 10.9537 1.6602 7.2167 14.2352 30.7990 9.7499 17.2183 80.5559 11.1851 57.9446 14.0839 132.0625 110.7151 12.9100 15.1583 17.4818 18.5379 31.6391 177.6176 53.2362 1.3893 9.1084 0.4796 2.8121 32.7315 4.1788 53.9003 0.8777 13.5011 45.1163 12.3725 21.4172 1.9568 3.9715 10.0980 15.7636 7.2509 1.5315 5.0601 6.4088 0.9335 16.9072 12.1194 16.4083 4.0542 16.3806 33.1663 6.3687 16.2278 45.7021 12.9766 12.4947 15.7619 12.4291 17.2663 12.8513 6.8873 1.1596 14.6730 6.8342 7.7257 5.8411
temp: 298.150 k
press: 1.00000 atm
elementType: 17 17 16 16 15 8 7 6 6 6 6 6 6 6 1 1 1 1 1 1 1 1 1 1 1 1 1 1
symmnumber: 1
zpe: 557542.6 jmol-1
zpe.correction: 0.212357 hartree
zpe.thermalcorrener: 0.229960 hartree
zpe.thermalcorrenthalpy: 0.230904 hartree
zpe.thermalcorrgfe: 0.163794 hartree
zpe.sumelectzpe: -2461.462218 hartree
zpe.sumelectthermal: -2461.444615 hartree
zpe.sumelectthermalent: -2461.443671 hartree
zpe.sumelectthermalfe: -2461.510781 hartree
dipole: -4.4182 0.5890 0.2756
dipole: 4.4658
quadrupole: -111.8313 -141.3770 -122.6860
quadrupole: 6.3204 0.1566 -3.1339
quadrupole: 13.4668 -16.0789 2.6121 6.3204 0.1566 -3.1339
hfenergy: -2461.6745751 hartree
pointgroup: C01 [X(C7H14Cl2N1O1P1S2)]
dipole: 1.5954001 0.6348459 -0.3724322 debye
polarizability: 192.4809943|6.3052074|156.1225867|-8.4753932|-28.5206956|154.3531207 unknown
InChI: InChI=1S/C7H14Cl2NOPS2/c8-2-4-10(5-3-9)12(14)11-6-1-7-13/h1-7H2
charge 0 multiplicity 1
28 atoms
Cl -4.107304 -2.830042 0.729139
Cl -1.918617 3.414412 -1.726308
S  1.634913 -1.216781 -1.611649
S  0.940552 -1.945184 1.988795
P  0.663509 -0.646089 0.407741
O  1.359691 0.964619 0.57896
N  -0.965758 -0.224369 0.016724
C  3.581969 0.654567 -0.573529
C  -2.103155 -0.881846 0.699275
C  -1.242842 0.800156 -1.01889
C  3.406343 -0.812111 -1.003679
C  2.842099 1.017779 0.726767
C  -2.540815 -2.140441 -0.068035
C  -1.432827 2.183916 -0.375117
H  3.261572 1.327867 -1.389081
H  4.662585 0.837303 -0.397969
H  -1.818264 -1.153297 1.73077
H  -2.939108 -0.161855 0.756928
H  -0.406337 0.835646 -1.739208
H  -2.152757 0.510902 -1.5762
H  4.040283 -1.064067 -1.869753
H  3.631074 -1.513462 -0.180877
H  3.141115 0.348294 1.558964
H  3.035161 2.063133 1.016661
H  -1.788926 -2.9407 -0.005798
H  -2.804551 -1.927231 -1.114886
H  -0.49824 2.554176 0.066361
H  -2.255164 2.203404 0.35549
