program: Gaussian 09
title: 000249123
version: EM64L-G09RevD.01
frameworkgroup: C1[X(C8H14I2O2)]
method: RPBEPBE
basis: SDD
operation: Freq
keyword: #p
keyword: freq=noraman
keyword: PBEPBE/SDD
title: #p freq=noraman PBEPBE/SDD
converged: YES YES NO NO
title: Mulliken charges:
elementType: I I O O C C C C C C C C H H H H H H H H H H H H H H
charge: 0.042968 0.042968 -0.259116 -0.259116 0.402550 0.402550 -0.355703 -0.355702 -0.851142 -0.851142 -0.725535 -0.725537 0.207133 0.207133 0.229791 0.229791 0.280484 0.300167 0.280484 0.300168 0.257856 0.229775 0.240770 0.240771 0.229776 0.257857
chargesum: 0.00000
title: Mulliken charges with hydrogens summed into heavy atoms:
elementType: I I O O C C C C C C C C
charge: 0.042968 0.042968 -0.259116 -0.259116 0.402550 0.402550 0.081222 0.081222 -0.270491 -0.270491 0.002867 0.002866
polarizability: 2.13091682e+02 -1.30325566e+01 9.90712049e+01 1.83050347e+01 -6.58105376e+00 1.02898605e+02
1716.lowfreq: -9.4468 -0.9728 -0.0004 -0.0002 0.0004 13.9247 32.0356 43.7125 53.7397
frequency: 32.0356 43.7125 53.7387 114.5884 137.0731 177.2137 193.2488 208.3450 227.9609 249.4920 262.4736 300.9205 344.4412 390.3573 396.5569 417.4294 423.8602 470.1230 524.4328 578.9697 601.1062 663.7375 701.1593 719.2029 794.0176 797.5818 882.0102 889.6588 904.4648 917.1686 945.1170 968.1668 997.6832 1009.3901 1067.2591 1082.8636 1136.0399 1137.3502 1185.2791 1190.0804 1211.0978 1227.5382 1228.2201 1236.8654 1278.1349 1300.7747 1350.7888 1353.8613 1383.5086 1387.6855 1420.0641 1420.8201 1448.6965 1451.8883 1465.7894 1466.5779 1486.5681 1486.6721 2985.0366 2986.1526 2995.6914 2996.4594 3056.0257 3056.0669 3078.1159 3079.1404 3088.9465 3089.4663 3109.1746 3109.3034 3143.5690 3143.5715
redmass: 7.9736 7.8766 8.9673 5.4878 2.9710 2.4472 5.8091 2.5479 1.3543 1.9531 1.5116 2.0971 2.2351 2.7842 1.8395 3.5447 3.5914 3.3946 3.7658 5.0420 4.8896 3.8358 5.0058 3.4266 2.0524 1.8352 1.9616 2.0562 1.8842 1.8286 1.7161 1.5410 7.1090 7.2661 1.4519 1.4593 1.9575 2.0325 1.3137 1.6570 2.4084 2.2355 1.2689 1.4070 1.4132 1.6603 1.2685 1.2539 1.2289 1.2249 1.1099 1.1117 1.0813 1.0785 1.0541 1.0517 1.0529 1.0538 1.0605 1.0620 1.0364 1.0386 1.0564 1.0564 1.1005 1.1012 1.0981 1.0984 1.1005 1.1005 1.1093 1.1092
irintensity: 0.7033 0.4452 0.0000 0.0000 2.4872 8.9208 0.0000 0.4606 0.0000 0.0000 3.2801 0.0000 2.0406 0.0000 10.3255 0.0000 24.7273 0.0000 0.0000 45.3891 0.0000 67.7069 0.0000 16.5139 15.1327 0.0000 0.0000 24.3652 63.0035 0.0000 0.0000 7.1806 0.0000 177.4249 0.0000 21.7768 0.0000 23.5224 14.1017 0.0000 90.0123 0.0000 0.0000 54.6047 0.0000 11.5916 0.0000 10.4458 0.0000 64.6885 13.8915 0.0000 25.0185 0.0000 0.0000 28.4276 0.0001 16.0016 0.0000 81.1591 25.3689 0.0001 0.0487 21.9580 0.0000 41.0243 43.2101 0.0000 0.0074 20.6121 0.2376 7.0508
temp: 298.150 k
press: 1.00000 atm
elementType: 53 53 8 8 6 6 6 6 6 6 6 6 1 1 1 1 1 1 1 1 1 1 1 1 1 1
symmnumber: 1
zpe: 548240.1 jmol-1
zpe.correction: 0.208814 hartree
zpe.thermalcorrener: 0.222722 hartree
zpe.thermalcorrenthalpy: 0.223666 hartree
zpe.thermalcorrgfe: 0.165136 hartree
zpe.sumelectzpe: -485.717841 hartree
zpe.sumelectthermal: -485.703932 hartree
zpe.sumelectthermalent: -485.702988 hartree
zpe.sumelectthermalfe: -485.761518 hartree
dipole: 0.0000 0.0000 0.0000
dipole: 0.0000
quadrupole: -124.0157 -101.0744 -96.8111
quadrupole: 8.2591 -2.3710 -2.3918
quadrupole: -16.7153 6.2260 10.4893 8.2591 -2.3710 -2.3918
hfenergy: -485.9266545 hartree
pointgroup: C01 [X(C8H14I2O2)]
dipole: 0.0000038 0.0000023 -0.0000017 debye
dipolederiv: -0.4356146 -0.1086585 -0.0237112 -0.193365 -0.1324427 -0.0119252 -0.1090455 -0.0420223 -0.0956799 -0.4356485 -0.1086752 -0.023701 -0.1931239 -0.1324673 -0.0118919 -0.1090692 -0.0420128 -0.0957276 -0.9955169 0.1315432 -0.0132595 0.3047502 -0.5520131 -0.0599377 0.0523935 -0.0621282 -0.4394792 -0.9955499 0.1315353 -0.013252 0.3047429 -0.5519861 -0.0599419 0.0523985 -0.0621558 -0.4394704 0.1519871 -0.1853516 0.0565492 -0.7133301 0.3537427 -0.0254314 -0.1890881 -0.1368612 0.2827098 0.1520749 -0.1853135 0.0565159 -0.7133188 0.3537314 -0.0254215 -0.1891864 -0.136833 0.2826965 0.6318866 -0.1478272 -0.0412334 0.1837459 0.2587248 0.0202133 0.117477 0.1211162 0.3057341 0.6318425 -0.1478496 -0.0412195 0.1836955 0.2586144 0.0202425 0.1175436 0.1211749 0.305727 0.7217243 0.3122583 0.1253668 0.3909042 0.151315 0.079285 0.1608618 0.0921371 0.0163309 0.7217146 0.3122217 0.1253883 0.3907653 0.1513321 0.0792618 0.1610796 0.0922096 0.0164147 -0.0628373 0.0190971 -0.020528 0.0749804 -0.0449363 0.0510348 -0.0195022 0.073393 -0.1816414 -0.063003 0.0190235 -0.0205155 0.0750037 -0.0449745 0.0510403 -0.0193513 0.0734085 -0.1816925 -0.0042148 0.0255557 -0.0004006 -0.0296337 0.0741681 0.0823915 0.0208279 0.0034374 -0.1719951 -0.0042084 0.0255514 -0.0003962 -0.0296219 0.0741806 0.0823866 0.0207715 0.0034013 -0.1719878 0.0258901 0.05076 0.0082441 0.0727348 -0.121427 -0.0166271 0.0073481 0.0291595 0.0866257 0.025886 0.0507523 0.0082405 0.0727751 -0.1213614 -0.0166339 0.0073459 0.0291536 0.0866262 -0.0476583 -0.0702481 -0.025667 -0.0030245 -0.0921604 -0.0625999 -0.0317097 -0.0421867 0.0802458 -0.0308676 -0.0329908 -0.1064427 -0.0941335 0.054296 0.0229057 -0.0643089 0.0271185 -0.0544833 -0.047672 -0.0702284 -0.0256665 -0.0032661 -0.0922215 -0.0626078 -0.0317736 -0.0422063 0.0802333 -0.030865 -0.0329917 -0.1064344 -0.0939985 0.0543428 0.0229173 -0.0644085 0.0270474 -0.0544962 0.0659354 -0.0514553 -0.0673536 -0.0844234 0.015724 -0.0744678 -0.0482424 -0.0371104 0.0309208 0.0282697 0.1085228 -0.019286 0.1323306 -0.0610756 -0.0043597 0.0003533 -0.0383341 0.0884447 -0.0489599 -0.0511863 0.1277073 -0.0415236 0.0961072 -0.0004958 0.1026389 0.0122781 0.0522674 -0.0488192 -0.0511291 0.1276661 -0.041502 0.0961234 -0.0005091 0.102571 0.0122516 0.0522957 0.0282939 0.10852 -0.0192798 0.1322982 -0.0610688 -0.004377 0.0003436 -0.0383393 0.0884488 0.0659303 -0.0514363 -0.0673314 -0.0844618 0.0157324 -0.0744514 -0.0482684 -0.0370967 0.030932 unknown
polarizability: 208.8574594|28.3331302|107.2183229|11.6417611|7.6086811|98.9857095 unknown
InChI: InChI=1S/C8H14I2O2/c1-7(3-9)5-12-8(2,4-10)6-11-7/h3-6H2,1-2H3
charge 0 multiplicity 1
26 atoms
I  -4.443652 -0.592457 0.085817
I  4.439804 0.601442 -0.090967
O  -1.000026 -1.004025 -0.033499
O  0.996172 1.013026 0.028334
C  -1.428797 0.42694 -0.021504
C  1.424944 -0.417942 0.016342
C  0.292455 -1.224692 -0.694024
C  -0.296308 1.233692 0.68886
C  -2.660121 0.458813 0.886486
C  2.65627 -0.449813 -0.891647
C  -1.681658 0.9606 -1.444227
C  1.677801 -0.951599 1.439066
H  0.238157 -0.941685 -1.764127
H  -0.242009 0.950684 1.758963
H  0.464252 -2.310874 -0.609233
H  -0.468105 2.319874 0.60407
H  -3.007523 1.488952 1.060292
H  -2.459622 -0.05589 1.838072
H  3.003668 -1.479953 -1.06546
H  2.455772 0.064898 -1.843228
H  -2.262689 0.227565 -2.027695
H  -2.261757 1.900253 -1.402114
H  -0.730527 1.173005 -1.961347
H  0.726668 -1.164014 1.956179
H  2.25791 -1.891246 1.396956
H  2.25882 -0.218559 2.022538
