program: Gaussian 09
title: 000249119
version: EM64L-G09RevD.01
frameworkgroup: C1[X(C7H6F3N5)]
method: RPBEPBE
basis: SDD
operation: Freq
keyword: #pfreq=noraman
keyword: PBEPBE/SDD
title: #p freq=noraman PBEPBE/SDD
converged: NO YES NO NO
title: Mulliken charges:
elementType: F F F N N N N N C C C C C C C H H H H H H
charge: -0.156365 -0.156584 -0.140510 -0.172882 -0.024485 -0.049312 -0.067030 -0.584792 0.191942 -0.061287 0.083417 -0.220025 -0.629041 0.312331 -0.038293 0.269651 0.273640 0.246208 0.245876 0.333630 0.343911
chargesum: 0.00000
title: Mulliken charges with hydrogens summed into heavy atoms:
elementType: F F F N N N N N C C C C C C C
charge: -0.156365 -0.156584 -0.140510 -0.172882 -0.024485 -0.049312 -0.067030 0.092748 0.191942 -0.061287 0.083417 0.049626 0.136683 0.312331 -0.038293
polarizability: 1.32621185e+02 -1.72420328e+01 1.49201079e+02 3.34106763e-02 4.67145147e-03 5.67253159e+01
1716.lowfreq: -8.8663 -3.8335 -0.0007 0.0004 0.0010 3.9197 24.3290 56.8998 70.8024
frequency: 23.6030 56.8679 70.7964 125.4126 138.2573 162.8354 214.9412 260.7640 271.4660 296.2208 302.8964 349.1015 379.7221 457.6163 463.0309 479.9985 498.1650 521.7426 528.8767 621.3606 634.7064 655.3203 662.5767 699.5644 721.7975 793.3450 796.3542 832.0191 868.1755 955.4273 1000.8311 1015.4882 1040.7662 1057.6292 1083.0704 1126.1129 1195.8295 1225.2515 1268.8286 1287.4423 1310.7688 1363.1048 1404.0496 1420.5656 1459.8202 1480.2478 1481.2718 1516.7930 1544.3278 1594.2458 1613.0803 2998.9895 3090.8483 3116.7904 3229.3097 3562.9074 3720.7183
redmass: 13.5563 1.0286 5.4713 8.9615 5.7993 5.4875 3.2162 5.6682 7.2286 10.7084 12.2962 8.2358 3.7876 11.0674 11.6877 1.2606 6.9550 1.0439 6.0962 4.2713 12.8654 5.6894 10.7171 7.3003 12.1787 11.1715 5.0982 1.6668 10.4786 5.4641 12.9914 2.4862 2.8457 5.3518 3.8554 1.3114 2.0599 4.9568 3.7676 3.3567 6.5907 7.1059 6.6993 1.6853 2.2046 1.0616 1.1199 2.6478 9.8969 7.2758 1.6901 1.0334 1.1030 1.1011 1.0985 1.0444 1.1060
irintensity: 0.0000 0.0176 0.9534 0.3322 3.3353 4.6996 3.0258 0.4389 8.5771 2.7885 0.9963 0.8134 6.6272 20.7135 5.2985 274.7541 1.6603 15.7120 7.6115 18.4786 11.9661 10.0280 0.0951 9.8508 5.5968 0.1446 21.5955 7.5568 71.3999 32.5873 238.4208 39.6066 41.1947 111.7841 96.2237 0.4660 41.1023 135.5349 3.9531 44.7846 20.8681 95.2680 33.2507 29.7661 84.7972 22.1285 38.4066 84.6538 31.3029 144.2430 526.5751 49.6800 18.9562 2.2686 0.0621 153.4212 54.0885
temp: 298.150 k
press: 1.00000 atm
elementType: 9 9 9 7 7 7 7 7 6 6 6 6 6 6 6 1 1 1 1 1 1
symmnumber: 1
zpe: 365172.4 jmol-1
zpe.correction: 0.139087 hartree
zpe.thermalcorrener: 0.152188 hartree
zpe.thermalcorrenthalpy: 0.153132 hartree
zpe.thermalcorrgfe: 0.098206 hartree
zpe.sumelectzpe: -842.555737 hartree
zpe.sumelectthermal: -842.542636 hartree
zpe.sumelectthermalent: -842.541692 hartree
zpe.sumelectthermalfe: -842.596618 hartree
dipole: 7.2649 2.7909 -0.0117
dipole: 7.7825
quadrupole: -76.6114 -72.8768 -86.9177
quadrupole: -7.8909 -0.0017 -0.0418
quadrupole: 2.1906 5.9251 -8.1157 -7.8909 -0.0017 -0.0418
hfenergy: -842.6948239 hartree
pointgroup: C01 [X(C7H6F3N5)]
dipole: -2.8545425 -1.1073963 0.0184581 debye
dipolederiv: -0.506875 -0.1113483 0.0956871 -0.178438 -0.4379046 0.2611057 0.0798345 0.2082212 -0.6247752 -0.5115535 -0.1140033 -0.1001127 -0.1828443 -0.4289426 -0.2530298 -0.08602 -0.2018512 -0.629632 -0.7493293 0.2477894 0.0079309 0.1893821 -0.4692909 -0.0040855 0.007191 -0.0046832 -0.2742007 -0.731521 0.2082268 0.0093516 -0.1834777 -0.5224019 -0.0008828 0.0035202 -0.0051099 -0.151734 -0.5755191 -0.0127865 0.0042272 0.0505669 -0.2713428 -0.0012307 0.0046288 -0.0003482 -0.2207123 -0.4644293 0.4047118 0.0067572 -0.0129757 -0.9545065 -0.0066324 0.0026464 -0.0118134 -0.2365594 -0.3210284 -0.5902099 -0.0041003 0.3301913 -1.0613639 -0.0118343 0.0042512 -0.0008842 -0.2092179 -0.1255905 -0.0794735 -0.0077654 0.1484713 -1.7382552 -0.0101113 -0.0057007 -0.0075298 -0.7087937 0.6601938 -0.5073427 -0.0108934 -0.0950376 0.6155883 0.005115 -0.0071211 0.0100279 0.1365975 -0.6160079 0.1714811 0.0094342 -0.2379752 0.0076374 0.0026315 0.0059522 -0.0022809 0.0618821 0.2736866 -0.0733835 -0.004219 -0.4163924 0.6853213 0.01122 -0.0061963 0.0070434 -0.0357657 0.4908873 0.2580113 -0.0044738 0.4281888 0.2822215 -0.002132 -0.0024356 -0.0003243 -0.051062 0.5854596 -0.1085439 -0.0065311 0.0668966 0.0203684 -0.0036358 -0.0038449 -0.0016675 0.234343 1.9269748 -0.0269723 -0.005699 0.1788435 1.3053192 -0.0041607 -0.0038693 -0.0016989 1.5033065 0.2300578 0.2008489 0.0013498 -0.1333114 2.2008668 0.0204018 -0.0020004 0.0185299 0.2051287 0.0472599 0.0663154 0.0020538 0.0421565 0.059916 -0.0015561 0.0017974 -0.0016532 0.1752337 0.1096515 0.0140003 0.0010104 -0.0932628 -0.0142108 -0.0022254 -0.0006446 -0.0030441 0.1277915 -0.037297 0.0282518 0.0383179 0.0562562 0.0816362 -0.0851862 0.1102763 -0.0734304 -0.0471821 -0.0391883 0.0312172 -0.0374263 0.06362 0.0753885 0.0888981 -0.10736 0.0770637 -0.0368294 0.1533495 0.0868166 0.0035527 0.0202452 0.2685035 -0.0018458 0.0027651 -0.0033635 0.3914685 0.2008183 -0.0936069 0.0015482 -0.0411031 0.2954523 -0.0008232 0.0023297 -0.0012033 0.3907127 unknown
polarizability: 132.7210506|-17.2848702|149.0793153|-1.0673863|1.0251631|56.7472141 unknown
InChI: InChI=1S/C7H6F3N5/c1-15-2-12-3-4(7(8,9)10)13-6(11)14-5(3)15/h2H,11H2,1H3
charge 0 multiplicity 1
21 atoms
F  2.541482 1.290572 -1.160026
F  2.566635 1.268544 1.111557
F  3.387287 -0.491944 -0.050867
N  -2.440516 0.873519 0.029113
N  -0.442946 2.029023 0.015707
N  -1.578116 -1.434788 -0.000637
N  0.88743 -1.511333 -0.030367
N  -0.391035 -3.466755 -0.034464
C  -1.436525 -0.091967 0.009211
C  -0.197018 0.641272 0.000481
C  0.966497 -0.160051 -0.020199
C  -1.781558 2.120795 0.032418
C  -3.884825 0.610213 0.043555
C  2.35461 0.456062 -0.030244
C  -0.370227 -2.094498 -0.020145
H  -2.334682 3.058274 0.047123
H  -4.027538 -0.481819 0.024162
H  -4.348536 1.017136 0.958428
H  -4.372363 1.052682 -0.84187
H  -1.281245 -3.956185 -0.030304
H  0.492489 -3.96895 -0.052132
