program: Gaussian 09
title: 000249097
version: EM64L-G09RevD.01
frameworkgroup: C1[X(C14H10N4)]
method: RPBEPBE
basis: SDD
operation: Freq
keyword: #pfreq=noraman
keyword: PBEPBE/SDD
title: #p freq=noraman PBEPBE/SDD
converged: NO NO NO NO
title: Mulliken charges:
elementType: N N N N C C C C C C C C C C C C C C H H H H H H H H H H
charge: -0.435105 -0.435105 -0.079349 -0.079349 0.070093 0.070093 0.295200 0.295200 0.027142 0.027142 -0.371887 -0.371888 -0.345575 -0.345575 -0.212135 -0.212135 -0.232280 -0.232281 0.341565 0.341565 0.238562 0.238563 0.249930 0.249930 0.226303 0.226303 0.227536 0.227537
chargesum: 0.00000
title: Mulliken charges with hydrogens summed into heavy atoms:
elementType: N N N N C C C C C C C C C C C C C C
charge: -0.093540 -0.093540 -0.079349 -0.079349 0.070093 0.070093 0.295200 0.295200 0.027142 0.027142 -0.133325 -0.133325 -0.095645 -0.095645 0.014168 0.014168 -0.004744 -0.004744
polarizability: 3.92228983e+02 -4.60126489e+00 1.68147157e+02 -1.27066695e-03 6.08740509e-04 6.73977190e+01
1716.lowfreq: -4.8932 -0.0013 -0.0008 0.0008 2.3225 10.3400 45.3530 58.0480 64.2131
frequency: 45.3530 58.0480 64.2131 134.6249 250.4088 256.7225 256.9799 262.5303 271.1375 359.0225 420.6939 430.5937 450.1035 536.6263 559.6728 574.6597 579.1365 597.8100 615.2071 615.8433 656.3842 672.8164 676.7775 728.5188 757.2826 757.8440 767.3931 770.7341 771.1679 805.3169 859.9610 860.3685 878.2332 883.4651 905.0292 940.0180 940.4016 974.7809 978.6297 978.6774 1003.9028 1007.0004 1110.9892 1112.4286 1133.9234 1159.7790 1160.2723 1211.4272 1216.4773 1220.6970 1264.7051 1267.4050 1276.0506 1317.5400 1345.0485 1396.2646 1400.1184 1407.7042 1411.3595 1442.2176 1454.5756 1478.3610 1481.5350 1576.9400 1584.2490 1618.6414 1630.3465 1642.2754 3130.6993 3130.7073 3142.4966 3142.5450 3156.9153 3156.9460 3169.9801 3170.1797 3582.3668 3582.4074
redmass: 6.1732 5.5380 4.4145 6.2503 4.5907 7.1304 5.8778 5.0118 5.6489 5.3017 4.8578 2.9313 3.3425 7.5304 5.5430 3.6613 3.6387 7.7042 6.6709 6.2391 6.3070 1.1180 1.1553 6.6000 1.3987 1.4659 5.3269 3.3356 3.5123 4.7177 1.4969 1.5017 6.5416 6.1157 7.4574 1.3776 1.3784 6.6929 1.3071 1.3068 2.0995 2.2406 1.6602 1.6039 1.8936 1.1435 1.1500 1.9631 3.0086 1.7781 2.8990 2.6603 2.1002 2.1468 2.9726 5.3038 3.6814 3.2900 3.3731 3.6522 3.9499 3.4097 3.0363 6.0210 6.6946 8.6165 7.5116 7.9899 1.0855 1.0855 1.0902 1.0902 1.0957 1.0957 1.0997 1.0997 1.0816 1.0818
irintensity: 1.3686 4.1562 5.2638 0.0000 0.0000 0.0000 2.4573 10.7316 0.0000 0.0000 19.6854 18.5542 0.0000 6.3817 0.0000 2.1726 0.0000 0.0000 2.7850 0.0000 7.8701 0.0000 157.2680 0.0000 244.3530 0.0011 7.4883 31.2683 0.0000 0.0000 0.0000 0.0225 5.0615 0.0000 0.8369 0.0000 9.8398 0.0000 0.0378 0.0000 15.4145 0.0000 10.6867 0.0000 12.8763 0.0000 6.1823 0.0000 0.9695 0.0000 24.9925 0.0000 18.4172 0.0000 155.4218 0.0000 47.9858 67.5967 0.0000 0.0000 46.0666 0.0000 4.3778 0.0000 16.4815 0.0000 5.4976 0.0000 0.5212 0.1301 16.4541 0.0948 0.1994 45.8375 60.7220 0.0053 0.0000 126.8184
temp: 298.150 k
press: 1.00000 atm
elementType: 7 7 7 7 6 6 6 6 6 6 6 6 6 6 6 6 6 6 1 1 1 1 1 1 1 1 1 1
symmnumber: 1
zpe: 559856.3 jmol-1
zpe.correction: 0.213238 hartree
zpe.thermalcorrener: 0.225818 hartree
zpe.thermalcorrenthalpy: 0.226762 hartree
zpe.thermalcorrgfe: 0.173415 hartree
zpe.sumelectzpe: -757.324413 hartree
zpe.sumelectthermal: -757.311834 hartree
zpe.sumelectthermalent: -757.310889 hartree
zpe.sumelectthermalfe: -757.364237 hartree
dipole: 0.0000 0.0000 -0.0001
dipole: 0.0001
quadrupole: -85.1100 -91.0995 -110.6776
quadrupole: 7.8312 -0.0001 0.0003
quadrupole: 10.5190 4.5295 -15.0486 7.8312 -0.0001 0.0003
hfenergy: -757.5376511 hartree
pointgroup: C01 [X(C14H10N4)]
dipole: 0.0000012 0. 0.0000403 debye
polarizability: 392.243161|4.2419741|168.1329789|-0.0012716|-0.0006067|67.397719 unknown
InChI: InChI=1S/C14H10N4/c1-2-6-10-9(5-1)15-13(16-10)14-17-11-7-3-4-8-12(11)18-14/h1-8,15,17H
charge 0 multiplicity 1
28 atoms
N  -1.500456 1.130393 0.000244
N  1.500463 -1.130386 0.000305
N  -1.461419 -1.160012 0.000164
N  1.461426 1.160019 0.000172
C  -0.722028 -0.028877 0.000182
C  0.722035 0.028884 0.000189
C  -2.840641 0.730051 0.000185
C  2.840648 -0.730044 0.000193
C  -2.797853 -0.712003 0.00014
C  2.79786 0.71201 0.000137
C  -4.055488 1.448635 0.000184
C  4.055495 -1.448628 0.000177
C  -4.002954 -1.455427 0.000086
C  4.002961 1.455434 0.000057
C  -5.242435 0.687039 0.000133
C  5.242442 -0.687032 0.000096
C  -5.217297 -0.742387 0.000083
C  5.217304 0.742395 0.000036
H  -1.111941 2.073872 0.00024
H  1.111948 -2.073865 0.000325
H  -4.081211 2.543567 0.000222
H  4.081218 -2.543559 0.000232
H  -3.973676 -2.549458 0.000055
H  3.973683 2.549465 0.000014
H  -6.210616 1.199975 0.000136
H  6.210623 -1.199967 0.000086
H  -6.167243 -1.288039 0.00005
H  6.167249 1.288047 -0.000023
