program: Gaussian 09
title: 000249067
version: EM64L-G09RevD.01
frameworkgroup: C1[X(C14H15N5)]
method: RPBEPBE
basis: SDD
operation: Freq
keyword: #pfreq=noraman
keyword: PBEPBE/SDD
title: #p freq=noraman PBEPBE/SDD
converged: YES YES NO NO
title: Mulliken charges:
elementType: N N N N N C C C C C C C C C C C C C C H H H H H H H H H H H H H H H
charge: -0.173957 -0.694062 -0.157440 -0.624367 -0.623958 0.337488 -0.046204 0.321958 -0.364744 -0.394824 0.491495 -0.389525 -0.345747 -0.429800 -0.421116 -0.237303 -0.253283 -0.244649 0.246515 0.251565 0.248069 0.257863 0.257665 0.214045 0.211057 0.221842 0.219867 0.223146 0.302930 0.303521 0.304085 0.331467 0.357480 0.298922
chargesum: 0.00000
title: Mulliken charges with hydrogens summed into heavy atoms:
elementType: N N N N N C C C C C C C C C C C C C C
charge: -0.173957 -0.087611 -0.157440 0.011185 0.032444 0.337488 -0.046204 0.321958 -0.113179 -0.146755 0.491495 -0.131662 -0.088082 -0.215756 -0.210058 -0.015461 -0.033415 -0.021503 0.246515
polarizability: 3.15732104e+02 -1.98391638e+01 2.50403937e+02 -9.11815008e+00 -4.52714443e+00 1.03541570e+02
1716.lowfreq: -6.7688 -4.8218 -0.0007 -0.0007 -0.0003 3.4904 31.4751 49.4474 54.8505
frequency: 31.4599 49.4166 54.8476 63.3174 71.7804 84.1978 137.9685 189.3750 208.0063 231.7108 258.0043 267.9685 279.4658 316.5811 345.3096 375.9038 379.1087 397.8403 402.0183 410.5672 415.5433 442.3093 469.7176 498.2461 524.4815 532.1452 598.0738 612.7985 618.1058 634.0431 640.9384 654.3392 697.1020 716.3561 729.2150 750.9700 784.3665 816.3599 817.9394 832.8226 847.5329 888.1141 919.9090 950.8677 962.2651 964.6660 972.3464 988.9961 990.1283 1001.8580 1004.1077 1017.5917 1029.0201 1051.0795 1081.5005 1116.6433 1130.5365 1170.1280 1178.6014 1190.1640 1193.0307 1296.9513 1305.5541 1318.3875 1330.6240 1373.1625 1376.7342 1428.4110 1435.4456 1474.8783 1483.8818 1493.3389 1516.7487 1549.2692 1570.6648 1582.1609 1583.9464 1606.0143 1621.1681 1629.1881 1642.1903 3112.5752 3116.0338 3117.7011 3128.6944 3142.9927 3150.1174 3156.3398 3156.9111 3180.3286 3462.6481 3542.6231 3565.1384 3661.4584 3693.0406 3705.9300
redmass: 3.9012 4.5523 4.7846 4.2708 4.6351 4.1626 5.1936 4.8468 4.7476 2.7497 4.2986 1.6577 4.5469 2.9807 1.3018 2.8044 1.1568 2.3069 2.7246 1.7134 2.8256 2.7195 3.2639 4.3799 1.9781 1.4579 5.7515 5.5635 3.2538 4.8831 3.8516 4.3290 1.6801 1.7169 3.3285 4.2247 2.6663 4.7094 1.2864 1.8248 1.2584 5.5495 1.5272 1.4582 2.1649 1.8587 1.3822 2.4822 1.9148 2.6404 2.3781 1.4818 2.0511 1.8132 1.6268 2.2665 1.2777 1.0535 2.0772 1.3787 1.1687 2.1779 1.5306 1.8270 2.3362 5.6703 5.6751 2.4728 3.7714 2.6271 2.8507 3.1341 3.1649 2.8896 6.5951 6.0193 1.7615 5.6617 1.5043 2.5604 1.5406 1.0888 1.0883 1.0844 1.0887 1.0940 1.0941 1.0956 1.0984 1.0956 1.0491 1.0448 1.0447 1.0977 1.1037 1.1040
irintensity: 0.4969 5.3153 3.3263 2.1473 0.3188 1.7751 0.9654 2.7195 6.7681 38.1536 20.4045 127.8563 4.4956 41.5268 275.7884 24.7441 3.6294 109.8841 7.8679 154.2681 8.9114 28.7302 11.9598 16.2934 83.9733 81.2430 18.7252 0.8247 6.9323 8.7131 56.5617 4.3259 48.1984 138.2401 29.5685 2.6100 26.4220 2.6127 2.2796 72.6819 1.7742 32.6551 4.5590 3.9580 24.9685 18.6453 0.2215 0.0063 0.2393 1.8756 1.2299 1.3061 10.2306 12.5025 11.5283 35.5690 7.9413 0.2890 62.0484 24.7990 3.9919 14.7064 31.8938 48.6945 101.0717 9.6720 9.0208 22.6885 1.1574 24.4562 20.1627 228.7167 73.0282 355.9881 12.6075 12.8809 474.2840 6.1654 755.4417 14.6023 300.1417 18.2682 41.9208 0.7421 11.6566 43.8255 15.4181 14.1748 27.4438 6.4940 33.5507 65.3739 108.2012 64.5860 26.5868 19.3564
temp: 298.150 k
press: 1.00000 atm
elementType: 7 7 7 7 7 6 6 6 6 6 6 6 6 6 6 6 6 6 6 1 1 1 1 1 1 1 1 1 1 1 1 1 1 1
symmnumber: 1
zpe: 708793.7 jmol-1
zpe.correction: 0.269965 hartree
zpe.thermalcorrener: 0.287622 hartree
zpe.thermalcorrenthalpy: 0.288566 hartree
zpe.thermalcorrgfe: 0.223875 hartree
zpe.sumelectzpe: -814.890947 hartree
zpe.sumelectthermal: -814.873290 hartree
zpe.sumelectthermalent: -814.872346 hartree
zpe.sumelectthermalfe: -814.937036 hartree
dipole: -0.7294 -3.1064 -0.3108
dipole: 3.2059
quadrupole: -67.3309 -85.9284 -116.0291
quadrupole: -9.5373 -3.2596 -1.8527
quadrupole: 22.4319 3.8344 -26.2663 -9.5373 -3.2596 -1.8527
hfenergy: -815.1609119 hartree
pointgroup: C01 [X(C14H15N5)]
dipole: -0.3650263 -1.1937314 -0.1807327 debye
polarizability: 311.0184955|-22.058821|252.5655031|-24.8384032|7.7278048|106.093613 unknown
InChI: InChI=1S/C14H15N5/c15-12-8-6-11(7-9-12)13(18-19-14(16)17)10-4-2-1-3-5-10/h1-9H,15-17H2
charge 0 multiplicity 1
34 atoms
N  0.852903 -1.386455 -0.150761
N  -5.494863 -0.397675 0.225589
N  2.268733 -1.417375 -0.153228
N  4.065638 -2.910758 -0.22547
N  1.87728 -3.739437 -0.651085
C  -1.226007 -0.229193 0.057846
C  0.260073 -0.199205 -0.031258
C  0.969321 1.119902 0.037002
C  -2.028312 0.861985 -0.381986
C  -1.905031 -1.378967 0.55545
C  -4.100521 -0.343114 0.166698
C  0.547467 2.101257 0.977642
C  2.06601 1.429952 -0.814121
C  -3.433119 0.811339 -0.334511
C  -3.306265 -1.440794 0.614313
C  1.199095 3.350616 1.067426
C  2.704891 2.685716 -0.737508
C  2.279024 3.651229 0.20545
C  2.703358 -2.676235 -0.342144
H  -1.542762 1.757428 -0.784382
H  -1.302339 -2.222489 0.907053
H  -0.288662 1.874173 1.648282
H  2.411233 0.679272 -1.528878
H  -4.021858 1.665604 -0.69205
H  -3.799159 -2.335107 1.016966
H  0.864024 4.08712 1.806969
H  3.541059 2.910347 -1.409978
H  2.782646 4.622939 0.26797
H  -5.968982 -1.223877 0.577737
H  -6.0602 0.385577 -0.088102
H  4.505911 -3.700326 -0.690741
H  4.63369 -2.104295 0.027132
H  0.88552 -3.479694 -0.668244
H  2.162809 -4.706062 -0.522375
