program: Gaussian 09
title: 000249066
version: EM64L-G09RevD.01
frameworkgroup: C1[X(C9H12N4)]
method: RPBEPBE
basis: SDD
operation: Freq
keyword: #pfreq=noraman
keyword: PBEPBE/SDD
title: #p freq=noraman PBEPBE/SDD
converged: YES YES NO NO
title: Mulliken charges:
elementType: N N N N C C C C C C C C C H H H H H H H H H H H H
charge: -0.170780 -0.175111 -0.623982 -0.623275 0.326486 0.086781 -0.366840 -0.359026 -0.242860 -0.231588 -0.816414 -0.242420 0.253764 0.237104 0.245105 0.220721 0.219947 0.227412 0.286421 0.226313 0.224950 0.307742 0.331469 0.355730 0.302352
chargesum: 0.00000
title: Mulliken charges with hydrogens summed into heavy atoms:
elementType: N N N N C C C C C C C C C
charge: -0.170780 -0.175111 0.015228 0.034807 0.326486 0.086781 -0.129736 -0.113921 -0.022139 -0.011641 -0.076268 -0.017470 0.253764
polarizability: 2.61044301e+02 9.26586598e+00 1.33883415e+02 1.51055998e+00 5.27169674e-01 5.72570130e+01
1716.lowfreq: -2.6460 0.0003 0.0006 0.0007 5.8192 8.6100 25.0084 64.2343 90.6289
frequency: 24.8311 64.2243 90.6266 102.9784 163.8867 177.0902 217.9838 226.6585 291.3915 319.8233 349.9402 404.6019 409.1397 424.1231 455.6223 473.7519 519.4666 565.3868 596.3850 615.6088 632.2660 638.2509 695.3749 718.1831 773.3119 775.4091 849.1388 921.1739 922.2748 961.1361 978.8792 987.6391 994.4852 1017.8128 1021.7452 1035.1892 1043.5998 1083.7221 1092.7835 1133.4548 1168.9628 1186.3178 1308.9531 1319.7598 1373.5888 1381.1810 1431.7132 1451.0141 1481.3281 1485.3296 1493.4114 1515.4047 1565.6514 1584.8581 1586.7072 1612.3794 1626.0681 2977.6063 3053.4854 3117.0913 3119.7220 3129.5786 3147.4748 3158.3667 3167.4365 3480.5413 3550.8760 3672.0303 3701.5042
redmass: 3.6367 4.1561 4.4202 4.1810 2.5908 1.2183 2.4060 1.5558 3.8446 3.0805 3.4608 2.8381 1.3547 3.6238 2.5197 3.4363 1.2128 2.7751 4.2321 6.2472 4.0061 2.5635 1.7492 1.7275 1.8593 3.9276 1.2522 1.8892 2.9618 2.6037 1.3803 5.7280 1.3286 1.7470 2.2432 1.5859 1.6995 1.6195 2.5227 3.0610 1.0596 1.1233 1.5899 2.7234 1.2582 6.3144 2.3789 1.1931 2.3044 1.0516 2.2877 2.9694 3.0912 2.3277 3.5912 5.3764 1.5479 1.0382 1.0968 1.0968 1.0845 1.0886 1.0929 1.0950 1.0988 1.0483 1.0450 1.0990 1.1040
irintensity: 1.2847 1.0660 1.2224 11.2433 10.8871 2.5329 21.1712 104.9194 9.8978 3.5620 35.8986 0.2896 278.7623 34.7199 22.9833 13.9204 121.0853 3.2833 4.7335 0.1529 13.7096 34.1575 23.3238 171.6574 50.1527 2.9576 0.1882 23.8967 39.6879 28.4885 0.1596 1.9502 0.5749 6.5616 11.7337 0.5628 6.9429 10.5401 2.7187 97.7485 0.5580 0.6549 7.0566 22.0742 39.4210 10.3911 18.7018 1.6875 100.8378 16.8438 33.2694 433.7594 88.5869 299.7302 141.5314 26.1096 617.1855 28.8143 20.4196 7.9891 2.0386 12.0761 33.5756 35.3791 15.9863 30.9074 84.2517 68.9327 31.7035
temp: 298.150 k
press: 1.00000 atm
elementType: 7 7 7 7 6 6 6 6 6 6 6 6 6 1 1 1 1 1 1 1 1 1 1 1 1
symmnumber: 1
zpe: 530051.5 jmol-1
zpe.correction: 0.201886 hartree
zpe.thermalcorrener: 0.214780 hartree
zpe.thermalcorrenthalpy: 0.215725 hartree
zpe.thermalcorrgfe: 0.162014 hartree
zpe.sumelectzpe: -568.196064 hartree
zpe.sumelectthermal: -568.183170 hartree
zpe.sumelectthermalent: -568.182226 hartree
zpe.sumelectthermalfe: -568.235936 hartree
dipole: -3.5020 -1.5425 0.2054
dipole: 3.8321
quadrupole: -47.4561 -65.3651 -83.6717
quadrupole: 7.5080 -0.9991 0.5187
quadrupole: 18.0415 0.1325 -18.1741 7.5080 -0.9991 0.5187
hfenergy: -568.3979502 hartree
pointgroup: C01 [X(C9H12N4)]
dipole: 1.3628415 0.6434384 0.0414546 debye
dipolederiv: 0.9470595 0.1967413 -0.0323059 -0.2387975 -0.4909125 -0.0018216 -0.0963318 -0.0196323 -0.1601626 -2.2189415 -0.3502671 0.041901 -0.5493145 -0.5208417 -0.0045822 0.0056424 0.0092585 -0.2596531 -1.9154839 0.0625646 0.1860401 0.1493947 -0.3166998 0.1131074 0.4607591 0.132851 -0.7015329 -0.4317705 0.041049 -0.0829657 -0.5575657 -1.1602055 -0.1364038 -0.2142769 -0.2401984 -0.6460315 0.5999828 0.0177277 -0.015095 -0.1476741 -0.1605202 0.0046395 0.006378 0.0016018 -0.0005667 -0.1365217 -0.1380699 0.0076804 -0.289132 0.5370608 0.0097569 -0.0047686 -0.0078476 -0.0219175 -0.2659922 -0.0183303 0.0000947 -0.0836328 0.0651175 -0.014065 0.0068861 -0.019866 -0.1740325 -0.1876076 0.0770105 -0.0165142 0.2306994 -0.0460902 -0.0204482 -0.0218918 -0.0090135 -0.1431359 0.1281698 0.0748404 -0.0201645 0.1641791 0.0168197 -0.0208941 -0.0341059 -0.0181958 -0.1532582 0.0331789 -0.0172064 -0.0066892 -0.0854828 0.1510544 -0.0247159 0.0010943 -0.0234938 -0.1546849 -0.1563739 -0.0007503 0.0084808 0.0993411 -0.3195458 0.0020571 0.027533 0.0120576 0.1163272 -0.1136925 -0.0485594 -0.0059673 -0.0260592 -0.0559887 -0.0069925 -0.0002989 -0.0075197 -0.1785897 2.6589781 0.1277143 -0.1434498 1.3757513 1.4686908 0.0981218 -0.0814779 0.0799277 0.235922 0.1192089 0.0355282 -0.0015851 0.0226356 -0.1039756 0.0188196 -0.0025143 0.0187486 0.1425186 0.0285857 -0.1191611 0.0217076 -0.0855316 0.0288832 0.014664 0.0165603 0.0103129 0.1392238 -0.0871607 -0.1018956 0.0210199 -0.129129 -0.0009644 0.019542 0.0246585 0.0181725 0.1539975 0.0622681 0.0287093 0.0024303 0.075923 -0.1394307 0.0218617 -0.0012435 0.0234684 0.1518085 0.040758 -0.0779191 -0.1082123 -0.0808582 0.0289027 -0.0372361 -0.1076044 -0.0773144 -0.0285159 -0.0183164 0.1489786 0.0127169 0.0419722 0.1409499 -0.0010168 0.0069289 -0.0109035 0.1082901 0.0726673 -0.0624926 0.093246 -0.0756852 0.0274349 0.0398378 0.092686 0.0851556 -0.0604996 -0.1289993 0.0802792 0.009679 0.0878188 0.0573259 0.0040635 0.0085624 0.0035394 0.1634126 0.2363694 -0.0115399 -0.0241084 0.0544185 0.1663368 -0.0779102 -0.2072455 -0.0937347 0.3675476 0.2796124 -0.0383199 -0.0220205 -0.0713931 0.1623839 -0.0238783 -0.0639736 -0.0079327 0.3795294 0.2732625 0.1031319 0.016961 0.1279943 0.2762024 0.0163166 0.0505476 0.0543189 0.3357752 0.1807586 -0.0097636 0.0571205 -0.0098724 0.1880122 0.0071768 0.1274966 0.0862396 0.3882285 unknown
polarizability: 260.273286|12.528107|134.4371384|-6.5640244|-1.6109382|57.4743043 unknown
InChI: InChI=1S/C9H12N4/c1-7(12-13-9(10)11)8-5-3-2-4-6-8/h2-6H,10-11H2,1H3
charge 0 multiplicity 1
25 atoms
N  1.17499 0.022646 -0.056243
N  2.475649 -0.533952 -0.102331
N  4.729941 0.060565 -0.224501
N  3.116589 1.777437 0.084247
C  -1.209549 -0.275533 0.009256
C  0.166841 -0.840168 -0.025816
C  -2.344348 -1.12627 0.139999
C  -1.438667 1.129266 -0.092397
C  -3.652953 -0.59557 0.173767
C  -2.7426 1.657488 -0.058914
C  0.357208 -2.346097 -0.021872
C  -3.86183 0.798149 0.075585
C  3.405424 0.439089 -0.079373
H  -2.207725 -2.209624 0.219017
H  -0.571733 1.787151 -0.203722
H  -4.509591 -1.271711 0.276935
H  -2.89311 2.740415 -0.140903
H  -0.181557 -2.817553 -0.864989
H  1.429985 -2.575903 -0.101591
H  -0.034448 -2.7933 0.911899
H  -4.877174 1.209632 0.100564
H  5.491846 0.662025 0.076092
H  4.900192 -0.93505 -0.348975
H  2.11263 1.968064 0.148188
H  3.781091 2.516802 -0.123221
