program: Gaussian 09
title: 000249060
version: EM64L-G09RevD.01
frameworkgroup: C1[X(C18H18O4SSi)]
method: RPBEPBE
basis: SDD
operation: Freq
keyword: #p
keyword: freq=noraman
keyword: PBEPBE/SDD
title: #p freq=noraman PBEPBE/SDD
converged: YES YES NO NO
title: Mulliken charges:
elementType: S Si O O O O C C C C C C C C C C C C C C C C C C H H H H H H H H H H H H H H H H H H
charge: 0.154440 1.601168 -0.572824 -0.527524 -0.228727 -0.271037 -0.261594 -0.238195 -0.454448 -0.436234 -0.297232 -0.283147 -0.296967 -0.319846 0.278380 0.306352 -0.661227 -0.674141 -0.244187 -0.243008 -0.248457 -0.237163 -0.225365 -0.224410 0.248222 0.242999 0.230964 0.263556 0.304205 0.298674 0.242955 0.256119 0.269649 0.305207 0.269533 0.277813 0.233921 0.232392 0.232672 0.232610 0.231883 0.232021
chargesum: 0.00000
title: Mulliken charges with hydrogens summed into heavy atoms:
elementType: S Si O O O O C C C C C C C C C C C C C C C C C C
charge: 0.154440 1.601168 -0.572824 -0.527524 -0.228727 -0.271037 -0.261594 -0.238195 0.036773 0.058285 0.006972 0.015527 -0.054012 -0.063727 0.278380 0.306352 -0.086372 -0.126795 -0.010266 -0.010615 -0.015785 -0.004553 0.006518 0.007612
polarizability: 2.54294123e+02 -6.88457390e+00 2.71180385e+02 2.20717651e+00 7.02845462e+00 1.85566273e+02
1716.lowfreq: -6.3389 -0.0015 -0.0010 0.0008 4.6874 7.8310 22.4490 35.5659 43.6685
frequency: 22.3783 35.3616 43.5906 47.2549 64.1857 72.5281 78.4680 80.8553 97.4839 117.5387 126.1106 133.4848 154.9257 200.5762 205.3368 213.4567 227.6172 232.0147 249.8457 266.4791 307.1907 320.2004 371.5288 392.8655 395.1628 400.7586 434.6361 470.1784 480.9938 489.9588 565.2496 572.5285 592.1513 603.9146 613.6678 615.9996 619.9208 622.1309 640.6711 684.2399 699.8041 708.7678 712.0585 713.7673 754.5761 755.3058 832.4102 853.8470 868.2298 874.6426 911.9844 921.3764 944.1993 950.4340 965.9518 977.8628 986.2634 988.0471 992.7321 997.6528 1013.6767 1018.2224 1018.8468 1025.3349 1026.6878 1040.8796 1080.6507 1084.0948 1101.2309 1105.8491 1114.5554 1125.7223 1171.8488 1176.1845 1176.2886 1190.1552 1206.8809 1208.4495 1211.9175 1223.6202 1275.7632 1302.2547 1322.8794 1327.2230 1330.1290 1335.2143 1369.3628 1370.4578 1420.8560 1423.2599 1431.1962 1439.2031 1440.1013 1454.7285 1473.8200 1477.3739 1576.3466 1577.7555 1599.3581 1601.4181 1607.6815 1635.1099 2997.0893 2997.3017 3036.5045 3039.7007 3083.5117 3101.9913 3114.3537 3116.8884 3121.6403 3126.7644 3128.8745 3129.6067 3136.6759 3139.6786 3147.5667 3149.6402 3162.1039 3162.6143
redmass: 4.5122 6.5409 5.5254 4.8858 5.3174 5.7753 6.6157 10.4745 7.8057 6.5323 6.6042 7.1838 5.4643 5.2795 5.1287 3.6606 3.6023 4.4968 5.0026 2.8763 4.5811 4.1651 3.9963 3.0736 3.4755 3.0513 4.5840 5.8898 4.3390 4.7639 5.1549 5.4673 5.4039 5.5078 6.5542 6.3388 6.7082 5.4384 3.5585 4.9378 4.2541 1.9912 3.0495 3.3273 1.6848 1.5807 3.1799 2.4074 1.2487 1.2412 3.0175 2.6731 1.3508 1.3359 1.9240 2.4585 5.9383 5.0027 1.3672 1.3610 1.3320 1.3820 2.7528 3.1120 2.9344 2.3616 1.7650 1.7350 2.7537 1.9176 2.7502 1.3836 1.2963 1.0599 1.0589 1.2763 1.4314 1.3505 1.1788 2.1167 1.2405 1.2425 1.4996 1.3915 1.5631 1.5467 3.4731 4.0557 2.1861 2.1874 1.0890 1.1002 1.0812 1.0857 1.9571 1.9473 5.3946 5.4090 5.8110 5.5484 8.7894 10.8274 1.0645 1.0634 1.0587 1.0603 1.0981 1.1010 1.0875 1.1027 1.0853 1.0873 1.0886 1.1041 1.0925 1.0925 1.0961 1.0964 1.1016 1.1017
irintensity: 0.4431 1.0336 0.1344 0.1751 0.2517 0.4410 0.2980 1.5391 2.4135 6.1917 6.8157 2.5248 1.5430 0.6310 3.5269 1.6493 0.1894 1.7574 1.5876 2.1620 19.1508 15.4817 19.9912 2.4254 3.9715 1.3009 39.7621 37.0364 34.2516 62.6521 5.3325 42.8201 51.3094 19.3625 8.3346 5.4086 47.8410 7.4357 11.9013 20.9214 33.7854 101.1296 32.9096 69.3566 22.0722 25.4750 45.7804 19.5783 1.2930 0.2482 59.8626 32.7228 1.2116 0.5035 70.7439 90.3444 1.8306 11.7298 0.5423 0.3485 0.4980 1.1020 33.4727 0.0616 1.1701 3.7510 4.6459 3.4241 72.5725 168.8390 58.2346 169.0116 69.7356 0.7614 1.0232 30.8691 78.5678 45.3817 44.4832 321.3919 44.4327 22.5326 10.8406 3.2383 2.3135 81.4667 0.3368 1.8109 25.7982 18.2933 25.0768 18.0503 20.4652 9.7884 12.5441 16.0361 2.0929 2.6733 9.0296 0.5735 173.3708 236.8506 22.3721 2.8196 27.7807 34.6106 7.4973 2.6125 6.0646 8.4754 0.9669 12.6681 8.1892 4.3053 23.8339 17.9307 14.6152 13.1310 55.5532 44.4527
temp: 298.150 k
press: 1.00000 atm
elementType: 16 14 8 8 8 8 6 6 6 6 6 6 6 6 6 6 6 6 6 6 6 6 6 6 1 1 1 1 1 1 1 1 1 1 1 1 1 1 1 1 1 1
symmnumber: 1
zpe: 839051.5 jmol-1
zpe.correction: 0.319578 hartree
zpe.thermalcorrener: 0.342624 hartree
zpe.thermalcorrenthalpy: 0.343568 hartree
zpe.thermalcorrgfe: 0.265442 hartree
zpe.sumelectzpe: -1683.417174 hartree
zpe.sumelectthermal: -1683.394127 hartree
zpe.sumelectthermalent: -1683.393183 hartree
zpe.sumelectthermalfe: -1683.471309 hartree
dipole: -1.3426 -1.5477 -1.2279
dipole: 2.3887
quadrupole: -136.6140 -148.7795 -149.5641
quadrupole: -6.6676 -1.4162 -6.4340
quadrupole: 8.3719 -3.7937 -4.5783 -6.6676 -1.4162 -6.4340
hfenergy: -1683.7367514 hartree
pointgroup: C01 [X(C18H18O4S1Si1)]
dipole: -0.5042951 -0.6000928 -0.5184029 debye
polarizability: 255.0434244|-7.6249218|269.094303|0.4125941|12.9270485|186.9030538 unknown
InChI: InChI=1S/C18H18O4SSi/c19-17-11-13-23-14-12-18(20)22-24(21-17,15-7-3-1-4-8-15)16-9-5-2-6-10-16/h1-10H,11-14H2
charge 0 multiplicity 1
42 atoms
S  4.177497 0.906701 0.033413
Si -0.341469 -0.03313 0.026244
O  0.869567 -0.186186 1.288072
O  0.740928 0.148741 -1.379565
O  1.316257 1.753666 2.488308
O  1.932652 -1.845136 -1.451179
C  -1.405783 1.524234 -0.029533
C  -1.362585 -1.620273 0.077997
C  2.996498 -0.043054 2.415696
C  2.912377 0.163128 -2.455217
C  -1.210897 2.655035 0.808037
C  -0.825688 -2.890539 -0.271689
C  -2.442495 1.56163 -1.00742
C  -2.704224 -1.547221 0.549679
C  1.670921 0.630609 2.072645
C  1.827056 -0.625536 -1.73527
C  3.756969 -0.562269 1.180141
C  4.242371 0.065116 -1.671662
C  -2.038633 3.79296 0.670533
C  -1.617413 -4.054619 -0.158144
C  -3.262374 2.702561 -1.144848
C  -3.491254 -2.714769 0.665756
C  -3.061982 3.821855 -0.303496
C  -2.949244 -3.970992 0.310495
H  3.599082 0.68201 2.988363
H  2.779807 -0.90548 3.077093
H  3.060243 -0.280681 -3.460037
H  2.596637 1.210869 -2.570268
H  -0.416891 2.645663 1.562701
H  0.204268 -2.960141 -0.637912
H  -2.612581 0.702671 -1.669314
H  -3.138694 -0.580282 0.830836
H  4.701033 -1.042001 1.486536
H  3.139227 -1.276733 0.616808
H  5.047125 0.584408 -2.21683
H  4.534275 -0.987564 -1.522013
H  -1.878284 4.657287 1.324511
H  -1.193171 -5.026158 -0.435258
H  -4.052157 2.716756 -1.904107
H  -4.5213 -2.642477 1.032163
H  -3.698782 4.707854 -0.407531
H  -3.55989 -4.877009 0.398368
