program: Gaussian 09
title: 000249050
version: EM64L-G09RevD.01
frameworkgroup: C1[X(C20H26O2)]
method: RPBEPBE
basis: SDD
operation: Freq
keyword: #pfreq=noraman
keyword: PBEPBE/SDD
title: #p freq=noraman PBEPBE/SDD
converged: YES YES NO NO
title: Mulliken charges:
elementType: O O C C C C C C C C C C C C C C C C C C C C H H H H H H H H H H H H H H H H H H H H H H H H H H
charge: -0.212066 -0.227714 -0.157035 -0.132045 -0.152644 0.283723 0.202935 -0.510498 -0.516090 -0.475259 -0.586381 0.505516 -0.622425 0.284649 -0.630944 -0.819668 -0.808033 -0.352988 -0.557970 0.109540 0.082498 -0.777041 0.233635 0.215032 0.228204 0.215542 0.219828 0.201830 0.252418 0.220538 0.220417 0.230518 0.234134 0.224289 0.236872 0.250877 0.247539 0.224176 0.219801 0.256262 0.236922 0.216203 0.233550 0.242552 0.278765 0.238378 0.232829 0.258830
chargesum: 0.00000
title: Mulliken charges with hydrogens summed into heavy atoms:
elementType: O O C C C C C C C C C C C C C C C C C C C C
charge: -0.212066 -0.227714 0.076600 0.082987 0.075560 0.283723 0.202935 -0.075127 -0.061842 -0.034305 -0.121730 0.505516 -0.161263 0.284649 -0.132528 -0.119429 -0.121358 -0.110436 -0.279205 0.109540 0.082498 -0.047004
polarizability: 2.64881743e+02 -4.80113851e+00 2.11581534e+02 -9.81094795e+00 -1.79514919e+00 1.60502824e+02
1716.lowfreq: -14.0636 -8.6648 0.0005 0.0008 0.0009 6.6490 30.5167 51.9539 57.7074
frequency: 30.4261 51.9398 57.6981 70.5390 90.4416 100.2742 123.8266 158.3678 173.7892 190.4345 204.1886 212.0728 224.2446 239.3681 251.3585 261.0259 275.2224 293.0396 305.6997 328.3504 354.9114 370.6672 386.5785 398.5465 424.7383 450.4588 469.2909 481.3739 518.1508 525.0666 540.6210 551.0476 572.4515 588.4497 621.3339 648.8070 660.7532 684.5338 713.0574 743.4708 799.8077 820.8457 826.3161 839.5692 847.8484 867.1548 882.4473 890.4732 897.3881 920.9924 924.2471 937.8809 950.3032 961.0766 979.9946 992.0063 998.7926 1022.1067 1022.9102 1025.1696 1031.7348 1061.6001 1068.1617 1087.6377 1094.5702 1103.3073 1114.3218 1127.0672 1134.3795 1157.3330 1164.1894 1174.3533 1184.4740 1192.8542 1205.6332 1215.0857 1226.3900 1230.8855 1237.5069 1251.2074 1261.4641 1272.5344 1279.6834 1298.4234 1309.6725 1317.1229 1322.2686 1323.7895 1331.4763 1336.4579 1338.4256 1346.8654 1368.6678 1372.4222 1382.7445 1387.0774 1427.8425 1446.9520 1452.9850 1458.6025 1459.0787 1459.6101 1465.9537 1474.5736 1477.3748 1481.2782 1486.0069 1488.1175 1571.7179 1595.6510 1623.4840 1630.6982 2914.0820 2923.2145 2951.7664 2963.3926 2966.0080 2973.9516 2976.6065 2982.5056 2983.9824 2986.2015 2988.3549 2999.4395 3033.5847 3035.6772 3037.0385 3047.4483 3061.2109 3065.5901 3073.4748 3076.0516 3077.0282 3082.5865 3085.8253 3121.6979 3147.3783 3174.0658
redmass: 4.7914 2.7603 4.7844 2.8930 1.3636 4.1951 3.4336 2.4561 3.0766 2.2938 2.1339 2.0450 1.6919 2.9997 1.6965 2.4061 2.1102 2.7972 2.7677 2.3262 2.7129 3.3086 3.5638 2.4240 3.5247 3.8310 2.9847 2.6371 3.1565 2.5556 3.6887 3.0569 2.8655 3.5369 4.3774 2.8947 3.6782 3.0597 2.8464 2.9209 2.2297 1.9331 1.4570 2.6908 2.2831 1.4174 2.3333 2.3879 2.1122 1.7114 1.7412 1.9800 1.9215 1.9414 1.9531 1.9616 1.7789 1.8413 1.7831 2.5278 1.9729 2.2753 2.7399 1.5652 2.1183 1.8545 1.3946 2.0292 1.7525 2.1717 1.5492 1.8146 2.1697 1.9032 1.9721 3.2130 1.8497 1.8123 1.9114 1.7849 1.5900 1.5075 1.3676 1.3784 1.4158 1.6098 1.6732 1.7694 1.3731 1.4697 2.0900 1.6440 1.3137 1.4090 1.2090 1.2136 1.0846 1.0994 1.0963 1.0746 1.0889 1.0513 1.0894 1.0812 1.0593 1.0595 1.0654 1.0602 7.0224 7.2620 8.7539 10.2987 1.0822 1.0797 1.0668 1.0681 1.0638 1.0722 1.0678 1.0415 1.0383 1.0369 1.0542 1.0633 1.0989 1.0940 1.0991 1.0976 1.0979 1.0988 1.0969 1.0987 1.0992 1.0991 1.0990 1.0999 1.0951 1.0976
irintensity: 1.1783 6.6820 0.8110 0.3225 0.3622 2.0523 0.6925 0.8310 7.0202 1.3977 0.9645 0.1495 0.0655 0.4203 0.0211 0.2441 0.0768 0.1736 0.5999 0.6200 1.8267 2.4343 1.0561 2.0625 0.4383 3.0094 0.4670 0.3417 3.5511 0.2902 0.9963 3.4766 1.1260 1.2098 12.4489 8.0379 5.0516 5.3511 7.5406 1.5302 2.2481 3.9256 19.0258 19.9339 0.7903 12.2899 0.2227 3.3995 22.4711 12.3414 4.1159 12.2026 3.6139 9.3666 22.5765 2.5318 3.6213 2.8948 4.1164 4.5838 14.2430 3.4978 3.9757 5.4904 3.9876 0.8510 2.3556 3.4035 1.3939 0.5135 2.4285 13.5486 2.7433 17.0099 4.4398 34.7015 2.5839 37.3732 7.8556 13.5223 2.9075 9.3571 3.5334 9.3996 5.8936 15.3492 6.5185 8.1973 8.6424 0.6342 17.3510 12.4088 65.4563 21.3214 25.0894 22.3658 12.6764 20.0958 20.4975 3.6133 22.7002 20.5002 5.1844 14.5272 2.3301 1.0227 8.5238 10.5407 86.0747 87.4804 394.2754 54.3777 6.3975 16.2267 19.4969 20.4184 14.6252 9.9197 47.4341 32.1894 4.0971 4.3763 47.7850 8.0343 26.8010 29.8221 56.9301 36.4825 19.2545 7.8318 12.2976 42.9635 26.5033 24.0650 23.5473 14.8009 21.6138 5.2033
temp: 298.150 k
press: 1.00000 atm
elementType: 8 8 6 6 6 6 6 6 6 6 6 6 6 6 6 6 6 6 6 6 6 6 1 1 1 1 1 1 1 1 1 1 1 1 1 1 1 1 1 1 1 1 1 1 1 1 1 1
symmnumber: 1
zpe: 1075405.9 jmol-1
zpe.correction: 0.409600 hartree
zpe.thermalcorrener: 0.430432 hartree
zpe.thermalcorrenthalpy: 0.431376 hartree
zpe.thermalcorrgfe: 0.361171 hartree
zpe.sumelectzpe: -926.506891 hartree
zpe.sumelectthermal: -926.486060 hartree
zpe.sumelectthermalent: -926.485115 hartree
zpe.sumelectthermalfe: -926.555320 hartree
dipole: -3.9185 5.4271 1.2992
dipole: 6.8188
quadrupole: -163.7306 -133.7350 -132.6513
quadrupole: -1.4118 16.9631 -3.1213
quadrupole: -20.3583 9.6373 10.7210 -1.4118 16.9631 -3.1213
hfenergy: -926.9164911 hartree
pointgroup: C01 [X(C20H26O2)]
dipole: -1.5647898 2.1252862 0.4812996 debye
polarizability: 265.3433729|-4.4471658|211.5460793|-7.2842178|-1.766253|160.0766492 unknown
InChI: InChI=1S/C20H26O2/c1-12(21)16-6-7-17-15-5-4-13-10-14(22)11-20(13,3)18(15)8-9-19(16,17)2/h6,10,15,17-18H,4-5,7-9,11H2,1-3H3
charge 0 multiplicity 1
48 atoms
O  5.553905 -1.378141 -1.287952
O  -4.427506 -2.002419 -0.035333
C  0.267297 0.985969 0.353967
C  0.982723 -0.352765 -0.044593
C  -1.136976 0.939598 -0.276918
C  -2.005257 -0.256475 0.248193
C  2.456419 -0.422884 0.505325
C  0.142346 -1.616832 0.29952
C  -1.322327 -1.56558 -0.220366
C  1.080686 2.214208 -0.122815
C  -2.101336 2.156547 -0.240934
C  3.181169 0.875856 0.102897
C  2.539958 2.198381 0.420316
C  -3.371729 0.124008 -0.359169
C  3.314252 -1.528131 -0.186307
C  -2.199394 -0.26631 1.797125
C  2.509724 -0.586069 2.054216
C  -3.422346 1.477973 -0.581829
C  4.347785 0.641224 -0.572337
C  4.560359 -0.812069 -0.752926
C  -4.507173 -0.822865 -0.50156
C  -5.773525 -0.355892 -1.218406
H  0.173133 1.042955 1.45871
H  1.075907 -0.318573 -1.155633
H  -0.983467 0.732932 -1.361323
H  0.12732 -1.769504 1.394797
H  0.643259 -2.508768 -0.124707
H  -1.326936 -1.602843 -1.328963
H  -1.884507 -2.447154 0.13472
H  0.582091 3.148423 0.199682
H  1.108006 2.226088 -1.232039
H  -1.833581 2.956831 -0.954769
H  -2.155834 2.628348 0.764448
H  2.505546 2.344461 1.520169
H  3.124247 3.035955 -0.001225
H  2.775981 -1.998927 -1.031135
H  3.618589 -2.343455 0.492671
H  -1.260405 -0.468301 2.339842
H  -2.601351 0.696745 2.161935
H  -2.920138 -1.059617 2.062709
H  3.557935 -0.551176 2.402693
H  1.952061 0.210325 2.579012
H  2.085171 -1.556992 2.363421
H  -4.305096 2.02932 -0.924684
H  5.046201 1.393448 -0.948235
H  -5.542684 0.028217 -2.228563
H  -6.264219 0.460625 -0.655922
H  -6.473289 -1.201996 -1.298627
