program: Gaussian 09
title: 000239920
version: EM64L-G09RevD.01
frameworkgroup: C1[X(C23H23NO7S2)]
method: RPBEPBE
basis: SDD
operation: Freq
keyword: #p
keyword: freq=noraman
keyword: PBEPBE/SDD
title: #p freq=noraman PBEPBE/SDD
converged: NO YES NO NO
title: Mulliken charges:
elementType: S S O O O O O O O N C C C C C C C C C C C C C C C C C C C C C C C H H H H H H H H H H H H H H H H H H H H H H H
charge: 0.968905 0.966081 -0.552807 -0.547527 -0.557076 -0.520050 -0.440449 -0.196598 -0.434330 -0.501670 -0.181325 -0.580056 -0.762808 -0.767209 0.474199 0.217540 0.540393 0.531388 -0.367100 -0.361283 -0.366944 -0.372103 -0.357106 -0.359904 -0.390530 -0.354001 0.281325 -0.214516 -0.215274 -0.211337 -0.209821 -0.228025 -0.231387 0.346341 0.266811 0.228300 0.287276 0.334484 0.287489 0.337384 0.243142 0.257657 0.246226 0.244121 0.304479 0.301190 0.218129 0.249959 0.389915 0.235737 0.235078 0.232945 0.231614 0.235884 0.235053 0.352195
chargesum: 0.00000
title: Mulliken charges with hydrogens summed into heavy atoms:
elementType: S S O O O O O O O N C C C C C C C C C C C C C C C C C C C C C C C
charge: 0.968905 0.966081 -0.552807 -0.547527 -0.557076 -0.520050 -0.050533 -0.196598 -0.082135 -0.501670 0.165015 -0.084946 -0.141047 -0.142337 0.474199 0.217540 0.540393 0.531388 -0.123957 -0.103627 -0.120717 -0.127983 -0.052627 -0.058715 -0.172401 -0.104042 0.281325 0.021221 0.019804 0.021608 0.021793 0.007859 0.003666
polarizability: 6.03647196e+02 1.02080829e+01 3.59547857e+02 -1.19898024e+01 -3.04367453e+01 2.25410602e+02
1716.lowfreq: -9.7674 -5.7541 -0.0014 0.0010 0.0014 1.5155 9.0140 15.4897 21.4357
frequency: -5.0887 15.4226 21.3244 22.1658 32.5257 33.8651 46.2074 51.2217 57.8466 60.0762 68.3053 75.8255 78.0198 84.9810 92.2613 104.3397 115.9883 128.3621 147.7324 157.1690 161.7999 165.6294 180.6205 191.6059 192.6429 213.4551 253.2607 300.9925 310.3937 322.8847 327.9676 336.5496 340.1840 349.7322 350.1603 355.3990 360.4808 392.5949 402.1191 403.4515 405.7179 408.6077 429.5281 452.9392 475.1819 489.5000 502.3269 511.5977 520.5216 527.8671 562.0178 571.5521 582.2494 610.5928 613.3258 614.2614 635.3513 692.2314 694.2572 700.7835 717.0156 758.4468 775.8892 777.5080 792.5680 803.0401 805.7220 808.6347 819.5152 820.0106 826.6405 845.1979 855.5306 863.6096 882.1210 885.6647 925.4546 930.4670 933.1149 938.2999 946.8097 951.9727 958.0803 987.2607 988.0397 991.7453 992.3156 994.8750 1004.4402 1007.8144 1008.3107 1014.8145 1024.2848 1026.1271 1060.6896 1073.1598 1074.4894 1104.6154 1107.8764 1116.4692 1143.8107 1166.8742 1175.8314 1176.3134 1181.2348 1181.7807 1193.4135 1195.9453 1207.5823 1211.4735 1245.6682 1246.2006 1249.5808 1254.7474 1273.6928 1299.8193 1309.1976 1325.0403 1333.2805 1337.7983 1390.0926 1391.5715 1392.8349 1427.3635 1435.1235 1442.5332 1443.8424 1446.6161 1465.4283 1482.6308 1484.9886 1503.1218 1578.5765 1584.3017 1596.7866 1606.7530 1609.3888 1623.4226 1676.6010 2886.0687 3019.8245 3062.5917 3072.8357 3087.2742 3108.9474 3125.8435 3128.1340 3128.4503 3132.2209 3133.6639 3137.9143 3141.9558 3150.3649 3152.0709 3154.1989 3162.1673 3167.2725 3168.2324 3173.4614 3180.1070 3521.9123 3580.7405
redmass: 4.0168 6.9826 6.3343 5.6146 4.9814 5.4449 7.1253 5.3357 5.4460 6.7223 4.3396 7.5318 9.1605 7.6833 8.7145 6.4845 6.9913 7.6847 7.4681 10.1976 7.5556 7.6659 9.8044 7.9699 10.8406 10.6332 7.9641 4.2391 5.4283 5.8563 4.1797 5.7202 2.4783 3.7837 2.8146 1.1365 9.4223 8.8283 2.8367 2.9976 2.8723 2.9355 14.1632 8.3251 4.2756 4.1787 4.1261 4.1822 4.4361 3.3275 4.5391 4.3599 2.7427 2.0852 5.7787 6.3020 6.7490 4.6655 1.7200 1.7607 3.6762 4.3717 1.9412 1.9105 2.7156 2.9774 5.3176 3.1100 4.2699 4.2995 2.6765 2.3759 1.2629 1.2552 1.9732 2.0238 4.0231 1.5875 2.3756 3.0284 1.4234 1.5422 1.3810 5.9170 5.8381 3.3186 1.6176 1.3931 2.8799 2.9805 1.3420 1.3260 2.1606 2.1953 1.3244 2.2972 1.4891 1.5143 1.2632 1.1780 1.3714 1.1599 1.0573 1.0571 1.1421 1.1397 1.1310 1.1202 1.1632 2.4237 2.1149 2.7003 1.8544 2.3455 1.1561 1.8195 1.3766 1.2617 1.2796 1.2673 8.6310 8.3770 5.9763 2.8162 1.2302 1.5127 2.1169 1.5768 1.1000 2.3473 2.3030 2.6733 5.6295 5.7630 6.4080 5.8093 5.7609 6.3063 9.5747 1.0796 1.0604 1.0569 1.0568 1.1030 1.0875 1.0870 1.0862 1.0889 1.0888 1.0967 1.0925 1.0930 1.0888 1.0963 1.0967 1.1136 1.1013 1.1015 1.0969 1.1150 1.0641 1.0660
irintensity: 1.0951 0.1437 0.4071 0.5986 0.0458 0.1845 0.9479 1.0174 0.6003 0.0443 0.4319 1.2675 3.2111 3.4371 3.1699 2.7736 5.1077 8.0305 6.6188 4.7823 14.8412 34.4077 3.3871 2.7311 11.4217 0.9850 9.7002 4.4288 36.5305 3.0867 33.1122 15.1895 0.0798 6.7379 0.6765 143.8583 105.5976 13.4438 0.8571 10.9476 0.3388 1.9138 12.8511 91.5185 13.1149 29.8484 68.4971 11.3112 25.1472 45.7690 18.3917 5.9700 83.6352 55.7362 4.2822 0.2495 0.8251 48.4919 81.5251 36.7650 0.5792 12.1878 35.5936 9.9297 37.9138 88.7850 18.5674 21.9815 8.2833 8.5062 16.1904 11.5279 0.3289 0.2316 40.0629 4.5666 46.7179 4.5125 27.7908 25.8865 7.0479 2.5606 2.2129 2.2015 0.6414 46.0265 16.2041 0.9615 2.6982 21.6488 0.5186 0.0313 3.8935 3.1158 13.4412 89.4719 9.0308 79.7922 0.7754 1.6457 296.7763 11.8085 0.1960 0.6181 68.3296 19.1600 27.4157 1.3947 23.4623 0.3184 14.3907 72.0118 3.6731 98.2802 6.2521 31.7430 5.9851 37.9084 0.7995 0.7990 3.0741 1.9400 13.8875 11.2282 19.1807 8.0169 13.1691 9.2948 12.4801 0.9937 1.9429 110.0225 0.1911 0.3597 21.2611 42.5553 20.3094 90.8985 259.7174 15.1782 8.8902 3.5334 3.9448 2.4656 24.5069 3.3254 2.0864 1.0255 2.0607 10.7411 3.8523 5.4855 4.5671 24.8852 10.7043 2.1452 27.6391 48.0156 8.5108 5.9125 36.0665 58.7941
temp: 298.150 k
press: 1.00000 atm
elementType: 16 16 8 8 8 8 8 8 8 7 6 6 6 6 6 6 6 6 6 6 6 6 6 6 6 6 6 6 6 6 6 6 6 1 1 1 1 1 1 1 1 1 1 1 1 1 1 1 1 1 1 1 1 1 1 1
symmnumber: 1
zpe: 1084846.3 jmol-1
zpe.correction: 0.413196 hartree
zpe.thermalcorrener: 0.446176 hartree
zpe.thermalcorrenthalpy: 0.447121 hartree
zpe.thermalcorrgfe: 0.345019 hartree
zpe.sumelectzpe: -2264.971271 hartree
zpe.sumelectthermal: -2264.938291 hartree
zpe.sumelectthermalent: -2264.937346 hartree
zpe.sumelectthermalfe: -2265.039448 hartree
dipole: 6.1528 1.6651 -0.9932
dipole: 6.4510
quadrupole: -186.0672 -187.6453 -212.0072
quadrupole: -8.6791 10.3800 7.3627
quadrupole: 9.1727 7.5946 -16.7673 -8.6791 10.3800 7.3627
hfenergy: -2265.3844668 hartree
pointgroup: C01 [X(C23H23N1O7S2)]
dipole: 2.2915098 -1.0159581 0.3978932 debye
polarizability: 594.240506|-48.991414|365.4407197|1.9833025|-38.3404011|228.9244288 unknown
InChI: InChI=1S/C23H23NO7S2/c25-21-13-11-18(12-14-21)15-22(23(26)27)24(32(28,29)16-19-7-3-1-4-8-19)33(30,31)17-20-9-5-2-6-10-20/h1-14,22,25-26H,15-17H2
charge 0 multiplicity 1
56 atoms
S  -0.068922 -1.451561 0.738838
S  0.631378 1.357682 -0.719353
O  1.086194 -1.10771 1.831718
O  -1.44785 -2.184934 1.220185
O  1.62968 0.332941 -1.508554
O  -0.174736 2.484888 -1.581413
O  -1.375163 -0.583418 -2.315594
O  -3.07324 0.996856 -2.465542
O  -8.536328 0.513841 0.976818
N  -0.724646 0.395182 0.291292
C  -2.11176 0.417035 -0.241154
C  -2.904214 1.615059 0.375997
C  0.731546 -2.592298 -0.891899
C  1.585437 2.176096 0.927959
C  -4.388844 1.316057 0.534211
C  -2.262731 0.362299 -1.76961
C  2.030003 -3.140946 -0.495654
C  3.048696 2.088898 0.774901
C  -4.838875 0.497434 1.601969
C  -5.353091 1.836334 -0.368064
C  2.118409 -4.420794 0.12858
C  3.786912 3.166298 0.208076
C  3.223714 -2.399745 -0.744422
C  3.73547 0.9189 1.209141
C  -6.209414 0.209722 1.774761
C  -6.725973 1.564594 -0.205926
C  -7.152925 0.749764 0.8672
C  3.372576 -4.957195 0.475716
C  5.188706 3.083666 0.093025
C  4.475437 -2.942607 -0.394641
C  5.138199 0.842787 1.092657
C  4.553671 -4.219675 0.21269
C  5.866761 1.922345 0.537708
H  -2.552512 -0.528231 0.160558
H  -2.737033 2.506226 -0.252607
H  -2.449297 1.801854 1.364971
H  -0.117727 -3.287355 -0.959163
H  0.73588 -1.788244 -1.638672
H  1.136901 3.180049 0.891294
H  1.140428 1.519448 1.68905
H  -4.112536 0.081209 2.311293
H  -5.018343 2.446783 -1.212819
H  1.201472 -4.986004 0.334453
H  3.259035 4.064056 -0.135699
H  3.146728 -1.406361 -1.201389
H  3.160383 0.083779 1.627578
H  -6.538601 -0.423473 2.609312
H  -7.473391 1.966021 -0.896489
H  -1.456716 -0.576819 -3.307479
H  3.436548 -5.942579 0.949204
H  5.753498 3.917106 -0.337993
H  5.390137 -2.374879 -0.597422
H  5.663939 -0.054118 1.438269
H  5.529613 -4.639326 0.48178
H  6.957539 1.860971 0.451591
H  -8.731623 -0.069806 1.751463
