program: Gaussian 09
title: 000239900
version: EM64L-G09RevD.01
frameworkgroup: C1[X(C11H18O4)]
method: RPBEPBE
basis: SDD
operation: Freq
keyword: #pfreq=noraman
keyword: PBEPBE/SDD
title: #p freq=noraman PBEPBE/SDD
converged: YES YES NO NO
title: Mulliken charges:
elementType: O O O O C C C C C C C C C C C H H H H H H H H H H H H H H H H H H
charge: -0.284272 -0.284548 -0.242270 -0.242167 -0.084113 -0.084137 -0.464936 -0.462482 -0.418461 0.289140 0.288254 -0.492011 -0.491933 -0.660539 -0.660668 0.281262 0.281530 0.239766 0.244268 0.240578 0.242409 0.224816 0.223408 0.239505 0.243134 0.239533 0.243155 0.233481 0.215877 0.226460 0.233753 0.215918 0.226292
chargesum: 0.00000
title: Mulliken charges with hydrogens summed into heavy atoms:
elementType: O O O O C C C C C C C C C C C
charge: -0.284272 -0.284548 -0.242270 -0.242167 0.197149 0.197393 0.019098 0.020505 0.029762 0.289140 0.288254 -0.009372 -0.009245 0.015279 0.015296
polarizability: 1.64718023e+02 -2.98949106e-02 1.08315169e+02 5.57162502e-01 -8.96268394e-02 1.16891840e+02
1716.lowfreq: -60.2108 -25.6861 -19.4780 -13.6611 -6.3460 -5.7803 -0.0009 -0.0007 -0.0007
frequency: -59.9680 -19.0335 -16.6018 26.7123 44.2956 46.0708 62.4899 93.7778 111.6347 159.3020 184.6531 185.0209 213.1362 215.7028 268.5367 286.6247 346.5473 361.7924 465.6421 516.4333 542.5055 543.9234 629.7213 639.0590 702.6866 712.9121 787.3109 790.0337 791.7007 794.0445 828.4167 835.9712 876.4434 885.6941 926.8159 942.4413 956.5497 1014.5602 1015.7076 1060.9153 1070.3148 1076.0029 1077.5551 1082.7490 1085.1374 1085.9153 1123.7423 1133.0345 1148.6685 1193.1430 1206.8548 1242.8317 1243.0651 1253.4168 1264.7825 1270.5158 1299.8941 1318.0371 1322.6943 1332.5046 1338.1476 1351.7844 1397.7856 1397.9426 1443.8826 1444.0531 1452.7190 1454.6793 1470.8756 1470.8836 1481.5141 1481.6621 1482.5357 1643.9698 1648.4523 2994.1216 2994.3155 2999.2888 2999.3495 3014.0410 3022.9608 3030.9625 3047.4377 3047.7289 3066.2164 3073.8744 3083.6612 3089.4090 3095.8678 3095.9214 3099.8273 3103.3283 3103.4191
redmass: 1.7872 1.9156 1.9375 5.1460 4.6781 6.0286 3.5018 3.2039 2.6819 3.7166 1.1840 1.2088 6.2144 3.5170 4.7845 4.3506 3.1068 4.2734 3.4028 3.5691 2.7230 2.7783 4.5240 4.3208 3.3906 2.0135 2.1183 1.7790 1.4182 1.7358 5.6506 4.4873 2.5408 2.7910 2.8695 2.4511 2.3942 1.8090 1.8291 2.2945 2.4198 2.6864 2.6570 1.4064 1.6922 1.5723 2.9608 2.7365 1.5159 1.3517 1.4998 1.1779 1.1774 1.3163 1.4082 1.2183 1.3151 1.2958 1.5027 1.7100 1.7751 1.8104 1.2099 1.2099 1.0851 1.0848 1.0808 1.0812 1.0398 1.0398 1.0536 1.0530 1.0874 9.6948 9.6532 1.0604 1.0602 1.0385 1.0384 1.0590 1.0626 1.0646 1.0970 1.0969 1.1024 1.0860 1.0902 1.1024 1.1004 1.1004 1.1036 1.1002 1.1002
irintensity: 0.0117 0.3875 0.3188 0.1579 5.1412 0.7751 1.7260 0.0088 1.5857 2.4312 0.7090 1.4593 0.0334 1.3667 15.2622 7.0303 3.3054 27.7553 1.2564 0.0101 1.1217 1.9936 0.1145 4.6337 2.3377 2.6741 7.6853 12.8245 6.1770 14.5822 15.1783 4.0863 45.4322 5.4698 21.4999 6.7967 0.0674 70.2108 3.8565 240.2439 10.1672 187.6140 13.4132 10.2244 0.1035 3.9263 517.9475 59.2401 1.7500 11.2554 9.5091 1.1298 0.2459 3.3677 3.7183 0.5754 5.3740 1.3913 23.0513 15.0381 78.5012 0.1143 21.7381 16.4675 53.9849 6.7496 2.9534 16.4080 6.7261 18.6395 12.3350 19.4708 10.1882 299.2351 22.7645 24.5374 21.4288 35.8982 5.3650 23.7893 28.8598 20.7593 4.3307 4.3215 6.0363 5.3242 9.9393 1.7251 36.4976 24.1524 69.6507 29.2621 32.0346
temp: 298.150 k
press: 1.00000 atm
elementType: 8 8 8 8 6 6 6 6 6 6 6 6 6 6 6 1 1 1 1 1 1 1 1 1 1 1 1 1 1 1 1 1 1
symmnumber: 1
zpe: 721463.4 jmol-1
zpe.correction: 0.274791 hartree
zpe.thermalcorrener: 0.289583 hartree
zpe.thermalcorrenthalpy: 0.290527 hartree
zpe.thermalcorrgfe: 0.230767 hartree
zpe.sumelectzpe: -729.695246 hartree
zpe.sumelectthermal: -729.680454 hartree
zpe.sumelectthermalent: -729.679510 hartree
zpe.sumelectthermalfe: -729.739270 hartree
dipole: -0.0001 1.3830 0.0048
dipole: 1.3830
quadrupole: -83.1265 -86.9455 -96.8780
quadrupole: -0.0762 15.9339 0.0731
quadrupole: 5.8569 2.0378 -7.8947 -0.0762 15.9339 0.0731
hfenergy: -729.9700368 hartree
pointgroup: C01 [X(C11H18O4)]
dipole: -0.000024 -0.5441286 0.0006601 debye
polarizability: 164.1095658|-0.03381|108.3148021|5.3889167|0.0663299|117.5006649 unknown
InChI: InChI=1S/C11H18O4/c1-3-10(12)14-8-6-5-7-9(8)15-11(13)4-2/h8-9H,3-7H2,1-2H3
charge 0 multiplicity 1
33 atoms
O  1.823654 0.04537 -0.182973
O  -1.827711 0.04544 0.184173
O  2.853283 0.69356 1.809206
O  -2.858027 0.6781 -1.812609
C  0.531537 -0.148094 0.554041
C  -0.535704 -0.153202 -0.551737
C  0.455983 -1.560586 1.167865
C  -0.459178 -1.570005 -1.158086
C  0.021016 -2.504915 0.000492
C  2.923089 0.462819 0.581604
C  -2.927564 0.456414 -0.583315
C  4.159775 0.574069 -0.296858
C  -4.164419 0.57247 0.294276
C  5.344218 1.243119 0.422926
C  -5.346496 1.243967 -0.427148
H  0.416459 0.665069 1.289002
H  -0.42188 0.654801 -1.292568
H  -0.313274 -1.543091 1.960575
H  1.409973 -1.848569 1.639198
H  0.284021 -1.549856 -1.974991
H  -1.423966 -1.8712 -1.59823
H  0.861611 -3.135631 -0.336546
H  -0.784833 -3.182964 0.330369
H  4.426533 -0.450115 -0.625305
H  3.881228 1.11895 -1.217811
H  -4.434498 -0.450688 0.623337
H  -3.884968 1.117341 1.214908
H  5.602568 0.698964 1.347052
H  6.2311 1.262053 -0.23461
H  5.100777 2.280881 0.70882
H  -5.603279 0.701413 -1.352642
H  -6.234841 1.263002 0.228399
H  -5.101285 2.281914 -0.710914
