program: Gaussian 09
title: 000239887
version: EM64L-G09RevD.01
frameworkgroup: C1[X(C17H26O3)]
method: RPBEPBE
basis: SDD
operation: Freq
keyword: #pfreq=noraman
keyword: PBEPBE/SDD
title: #p freq=noraman PBEPBE/SDD
converged: NO YES NO NO
title: Mulliken charges:
elementType: O O O C C C C C C C C C C C C C C C C C H H H H H H H H H H H H H H H H H H H H H H H H H H
charge: -0.247173 -0.258848 -0.306301 0.390643 -0.483325 -0.435150 -0.428665 -0.397570 -0.383229 -0.097555 -0.738555 -0.347288 0.289424 -0.698915 0.148927 -0.362534 -0.352237 -0.244150 -0.210552 -0.526590 0.194112 0.203843 0.189241 0.236604 0.237994 0.194401 0.247883 0.193920 0.203783 0.207117 0.226946 0.223416 0.216564 0.220397 0.194568 0.194533 0.210920 0.210820 0.217973 0.271623 0.244319 0.226590 0.226576 0.213025 0.257448 0.225024
chargesum: 0.00000
title: Mulliken charges with hydrogens summed into heavy atoms:
elementType: O O O C C C C C C C C C C C C C C C C C
charge: -0.247173 -0.258848 -0.306301 0.390643 -0.085370 -0.009305 0.003730 0.044233 0.027671 0.129392 -0.078178 0.041813 0.289424 -0.059202 0.148927 -0.090911 -0.107918 -0.017559 0.016023 0.168907
polarizability: 2.48815867e+02 -6.78442204e+00 1.87389243e+02 3.67387651e+00 -3.51814819e+00 1.38261652e+02
1716.lowfreq: -4.7944 -0.0003 0.0005 0.0007 8.1727 10.5957 31.6368 32.5258 47.1689
frequency: 30.6635 32.4201 47.1259 53.9971 63.7107 71.2395 89.0285 109.7164 128.6701 137.0015 152.6187 182.7475 189.2593 197.1595 223.1583 233.1104 243.7829 279.0535 284.5362 288.2687 306.1669 335.7024 357.4093 382.0735 431.0347 443.3283 459.1396 492.7244 502.9125 519.4350 554.9122 571.2199 620.1514 659.6248 725.0413 726.5683 738.6570 760.1680 766.1818 778.7928 786.7794 852.2466 857.8910 886.5852 892.7718 895.5637 917.7998 930.6656 939.0380 946.0535 954.8485 961.6646 983.7899 990.5333 1010.0275 1023.7602 1033.0028 1038.4258 1058.8547 1074.3220 1080.5267 1091.2540 1101.5717 1116.9156 1151.0561 1165.4009 1168.2075 1177.6189 1178.9213 1185.9097 1212.2343 1216.6231 1228.8842 1263.2443 1274.5606 1275.9683 1289.5121 1292.6505 1310.9861 1314.6354 1337.2461 1340.9942 1345.8059 1352.9395 1361.9192 1367.8695 1386.8767 1388.7758 1393.5207 1423.4720 1443.1932 1448.7618 1456.1903 1457.4118 1465.1981 1467.1325 1473.0108 1476.4451 1478.5439 1480.7234 1481.0662 1484.7970 1487.5984 1490.5935 1589.3884 1612.9094 2919.9924 2922.0373 2930.9196 2949.0746 2959.6176 2962.0003 2972.3248 2973.6783 2979.4934 2984.1940 2995.4138 3006.0224 3038.6369 3044.8482 3057.2768 3069.3604 3070.2296 3072.5035 3073.3656 3078.2151 3082.1173 3113.6079 3128.6391 3145.6234 3160.1318 3175.0281
redmass: 3.9777 4.3629 3.8276 2.5183 1.8562 2.5234 2.8018 3.2025 2.9522 2.6150 2.8784 2.0176 1.8607 2.3064 2.0925 1.1482 2.6149 2.1963 3.0144 3.2955 3.2567 2.5263 3.3254 2.2134 2.8038 3.2610 4.1802 3.3603 5.6346 4.4760 5.5431 3.7031 5.8177 3.9052 1.8456 1.4120 2.5683 2.6736 1.5216 1.6570 1.3028 2.2747 3.8126 1.9315 1.9264 1.7905 3.5501 2.3743 1.9455 3.1276 4.5041 1.7034 2.1524 1.3310 1.9040 2.2696 2.0161 3.5660 2.9796 2.1274 1.9714 2.2025 2.1280 1.2435 1.3441 1.0953 2.2381 1.8757 1.8098 2.2902 1.5548 1.6212 1.3785 1.2672 1.4338 1.3364 1.2615 1.1158 1.3167 1.1563 1.3665 1.3207 1.7438 1.8489 1.5167 1.3343 3.7666 1.2383 1.2175 1.3574 1.8295 1.0778 1.0862 1.0556 1.0731 1.0739 1.0695 1.0738 1.0435 1.6311 1.3962 1.0645 1.0492 1.0794 6.9552 6.9317 1.0806 1.0702 1.0693 1.0612 1.0315 1.0585 1.0544 1.0425 1.0367 1.0659 1.0928 1.1007 1.1036 1.0956 1.1031 1.1005 1.0973 1.0993 1.0960 1.0982 1.0946 1.1022 1.0856 1.0907 1.0965 1.0974
irintensity: 0.1225 0.2057 0.1540 0.0787 0.9850 6.4976 2.4472 3.5982 2.0844 1.9877 6.7000 1.5141 2.0782 1.5468 0.3062 0.0332 0.9180 0.9733 0.6265 2.2287 0.3797 1.6661 1.0409 2.3069 1.7422 0.1071 9.5941 4.2646 10.4777 3.3923 5.5555 5.8983 1.5921 8.3238 0.6284 9.1805 42.7810 4.0045 10.2942 64.6012 10.9275 13.8397 32.9290 16.1663 9.6240 2.8874 27.3022 4.9441 16.8620 11.3944 32.6960 15.4001 7.6037 0.1103 64.6101 122.7662 8.0712 50.7484 2.5942 33.7803 13.0113 31.2525 19.6808 0.7413 0.3825 5.3336 2.0623 10.3152 28.7807 7.7695 23.6166 32.9592 1.7070 2.3999 13.3238 3.8062 3.3600 2.9736 6.0766 5.6294 0.2894 5.3056 28.0169 24.2981 1.0015 5.9556 21.1381 16.6272 11.5417 13.0962 15.2562 4.3203 5.8414 10.2747 0.6181 5.9915 10.3554 17.9884 14.8072 10.1250 34.2266 12.4687 7.4190 6.0715 15.5068 13.8686 18.8527 14.7381 92.6269 46.4782 69.6303 16.8555 33.6866 51.1993 34.2730 26.1989 24.4022 0.6919 55.4831 0.9767 28.6716 61.4263 54.9875 57.2034 41.6013 48.2312 36.2843 28.2833 2.7681 17.4958 21.2390 11.9735
temp: 298.150 k
press: 1.00000 atm
elementType: 8 8 8 6 6 6 6 6 6 6 6 6 6 6 6 6 6 6 6 6 1 1 1 1 1 1 1 1 1 1 1 1 1 1 1 1 1 1 1 1 1 1 1 1 1 1
symmnumber: 1
zpe: 1038696.8 jmol-1
zpe.correction: 0.395619 hartree
zpe.thermalcorrener: 0.417088 hartree
zpe.thermalcorrenthalpy: 0.418033 hartree
zpe.thermalcorrgfe: 0.344408 hartree
zpe.sumelectzpe: -887.477608 hartree
zpe.sumelectthermal: -887.456139 hartree
zpe.sumelectthermalent: -887.455195 hartree
zpe.sumelectthermalfe: -887.528819 hartree
dipole: -2.0780 1.0884 0.8575
dipole: 2.4976
quadrupole: -110.9583 -116.0920 -126.5905
quadrupole: -0.8598 5.3916 1.0354
quadrupole: 6.9220 1.7883 -8.7103 -0.8598 5.3916 1.0354
hfenergy: -887.8732272 hartree
pointgroup: C01 [X(C17H26O3)]
dipole: 0.8243094 0.1715659 -0.5065797 debye
polarizability: 248.8249502|7.9229509|175.7447509|0.6157|-21.078995|149.8970604 unknown
InChI: InChI=1S/C17H26O3/c1-4-6-11-17(5-2)12-19-16(20-13-17)14-9-7-8-10-15(14)18-3/h7-10,16H,4-6,11-13H2,1-3H3
charge 0 multiplicity 1
46 atoms
O  -0.467591 0.195878 -1.021341
O  -0.05917 -0.368027 1.289123
O  -3.123366 2.010792 -0.429142
C  1.909676 -0.036879 -0.237429
C  3.282288 0.692587 -0.332676
C  0.91217 0.706166 -1.171365
C  1.336982 0.110406 1.201595
C  1.990868 -1.550367 -0.600978
C  4.430347 0.100338 0.518339
C  -0.913007 0.381302 0.378947
C  2.576258 -1.87973 -1.990978
C  5.755043 0.877287 0.337513
C  -2.33257 -0.117043 0.497583
C  6.912285 0.295934 1.177667
C  -3.400921 0.70585 0.057391
C  -2.627956 -1.387403 1.04419
C  -4.740095 0.267859 0.154791
C  -3.963872 -1.83475 1.139647
C  -5.021431 -1.006309 0.694893
C  -3.053214 2.103619 -1.903549
H  3.141287 1.756689 -0.043053
H  3.603333 0.709916 -1.394983
H  0.926655 1.796967 -0.94275
H  1.159825 0.563692 -2.235826
H  1.888107 -0.505111 1.930437
H  1.376706 1.177455 1.519274
H  0.969667 -1.967337 -0.529144
H  2.591385 -2.065299 0.175591
H  4.156036 0.107744 1.592999
H  4.596283 -0.960514 0.244068
H  -0.835977 1.469926 0.608572
H  1.975461 -1.437216 -2.806353
H  3.61738 -1.524196 -2.103291
H  2.581848 -2.973522 -2.150767
H  5.595571 1.940677 0.610558
H  6.03563 0.871396 -0.735842
H  7.110494 -0.757768 0.904467
H  6.671389 0.321935 2.257255
H  7.847705 0.865431 1.027146
H  -1.799052 -2.005401 1.40057
H  -5.542893 0.936799 -0.173448
H  -4.180793 -2.820769 1.564516
H  -6.059941 -1.346404 0.777072
H  -4.010222 1.786312 -2.362731
H  -2.224777 1.476207 -2.280975
H  -2.868629 3.166283 -2.125582
