program: Gaussian 09
title: 000239877
version: EM64L-G09RevD.01
frameworkgroup: C1[X(C13H15ClO4)]
method: RPBEPBE
basis: SDD
operation: Freq
keyword: #p
keyword: freq=noraman
keyword: PBEPBE/SDD
title: #p freq=noraman PBEPBE/SDD
converged: YES YES NO NO
title: Mulliken charges:
elementType: Cl O O O O C C C C C C C C C C C C C H H H H H H H H H H H H H H H
charge: -0.059469 -0.254883 -0.251442 -0.192925 -0.235203 0.226046 -0.713416 -0.706525 0.207320 -0.768297 0.270730 -0.430929 0.368279 -0.342861 -0.367534 -0.213173 -0.179055 -0.123238 0.265287 0.251351 0.217139 0.235260 0.234730 0.240219 0.273283 0.255918 0.246114 0.257250 0.231879 0.281066 0.259843 0.258892 0.258346
chargesum: 0.00000
title: Mulliken charges with hydrogens summed into heavy atoms:
elementType: Cl O O O O C C C C C C C C C C C C C
charge: -0.059469 -0.254883 -0.251442 -0.192925 -0.235203 0.226046 0.020360 0.003683 0.207320 0.007018 0.270730 0.058200 0.368279 -0.061795 -0.107691 0.045719 0.079291 -0.123238
polarizability: 2.04126124e+02 -2.47650581e+01 1.37723284e+02 -7.43555929e+00 -1.25065583e+01 1.34744565e+02
1716.lowfreq: -10.4946 -2.7481 0.0019 0.0020 0.0027 1.1226 10.2937 22.6900 50.6533
frequency: 6.3630 22.5929 50.5882 63.5741 67.2755 100.3452 108.7430 139.5344 151.2010 171.7403 182.5813 196.0505 219.2538 228.2175 254.6857 293.8222 312.8811 322.0464 331.5298 341.9362 378.0572 391.8562 416.5365 459.0063 499.2874 501.1423 511.5212 577.6824 592.9217 613.4097 624.5240 650.7391 697.5201 729.2186 768.7018 781.5868 812.8200 825.1595 878.7414 916.3672 937.0344 941.6034 954.1939 970.7038 979.6168 991.7190 995.9564 1002.9453 1025.1813 1071.7367 1107.7579 1118.8816 1147.3925 1177.9944 1184.0649 1201.3098 1220.1079 1255.1024 1263.8059 1293.5357 1348.5890 1370.6571 1372.4755 1377.7134 1394.1061 1403.0575 1447.1633 1450.2629 1455.0144 1455.6824 1463.6623 1472.1264 1472.8237 1489.6324 1585.6745 1601.6965 1616.5454 1628.4858 2994.3782 2999.5949 3008.5948 3024.2732 3084.4543 3102.3385 3107.1144 3108.1699 3112.1681 3120.7415 3123.5172 3153.6824 3159.8457 3173.0948 3179.7436
redmass: 4.6247 6.3936 5.5303 5.9492 5.0700 3.5512 4.2839 3.9069 1.4257 1.0689 4.5133 6.3564 1.5940 1.6530 3.2210 4.6021 5.0859 3.3673 4.0773 7.1159 3.2656 3.5279 3.0606 3.9444 3.2841 3.7930 3.8454 3.7772 4.6610 4.0811 6.0174 4.2453 3.6992 4.1125 5.5625 4.8823 1.2450 1.5504 3.9365 3.0354 1.3294 1.6404 1.3441 1.6199 6.2238 3.8983 1.5268 2.1950 1.6110 2.5581 1.4992 1.8932 2.1893 1.2718 2.3501 3.5521 3.5170 2.7681 1.6728 1.2697 1.2742 1.3299 4.2581 1.1967 1.1952 3.5146 1.0651 1.0507 1.0779 1.0594 1.0553 1.0880 2.1839 1.0552 7.1073 6.7618 9.9522 9.4755 1.0368 1.0347 1.0359 1.0600 1.0944 1.1006 1.1006 1.1045 1.1000 1.1021 1.0999 1.0890 1.0885 1.0967 1.0978
irintensity: 0.9092 0.2966 1.8896 0.9295 0.6268 1.7451 0.9587 1.6635 0.7675 0.2424 4.5229 2.2658 1.1698 2.7563 8.6239 5.6784 6.2649 1.1197 1.7542 2.3209 2.4492 12.8588 0.2552 6.2094 18.8721 15.0856 7.1174 8.9830 21.1927 16.4011 3.5066 11.7176 1.0154 10.9914 1.2428 13.4324 9.1871 99.4024 12.5381 50.1132 1.7433 4.2391 0.1011 7.2961 67.0505 58.0946 1.6142 23.1796 7.0608 37.9458 60.3258 89.4004 151.2395 57.5659 98.0250 30.4765 57.7573 12.6173 93.4930 3.5947 0.7538 34.4416 21.7261 37.6923 24.1544 0.4451 27.3746 2.4339 22.3415 35.6055 2.7186 5.1316 202.4578 22.6604 9.7053 13.1646 114.0991 123.2149 0.3887 10.6295 15.2055 30.2344 5.1466 16.3310 7.4149 7.0162 16.3169 9.7556 8.7074 1.2984 1.9449 1.5430 2.0067
temp: 298.150 k
press: 1.00000 atm
elementType: 17 8 8 8 8 6 6 6 6 6 6 6 6 6 6 6 6 6 1 1 1 1 1 1 1 1 1 1 1 1 1 1 1
symmnumber: 1
zpe: 663266.4 jmol-1
zpe.correction: 0.252625 hartree
zpe.thermalcorrener: 0.271692 hartree
zpe.thermalcorrenthalpy: 0.272636 hartree
zpe.thermalcorrgfe: 0.202407 hartree
zpe.sumelectzpe: -1263.974396 hartree
zpe.sumelectthermal: -1263.955329 hartree
zpe.sumelectthermalent: -1263.954384 hartree
zpe.sumelectthermalfe: -1264.024614 hartree
dipole: 1.5540 -3.1383 1.7829
dipole: 3.9297
quadrupole: -119.5093 -117.6529 -110.1478
quadrupole: -7.6927 4.1621 4.8744
quadrupole: -3.7393 -1.8829 5.6222 -7.6927 4.1621 4.8744
hfenergy: -1264.2270205 hartree
pointgroup: C01 [X(C13H15Cl1O4)]
dipole: 0.4345817 1.3153071 -0.6866383 debye
polarizability: 181.5021467|39.8683862|153.2875128|18.7255186|-2.4973775|141.804313 unknown
InChI: InChI=1S/C13H15ClO4/c1-9(15)13(2,3)18-12(16)8-17-11-6-4-10(14)5-7-11/h4-7H,8H2,1-3H3
charge 0 multiplicity 1
33 atoms
Cl -4.67735 -2.668092 -0.789418
O  2.042287 1.393942 0.05067
O  -0.755401 1.916096 -0.704297
O  3.749981 -1.604466 1.279996
O  1.031442 0.798795 2.074893
C  3.2995 0.585739 0.335153
C  4.069107 1.216457 1.505523
C  4.074388 0.681826 -0.995671
C  2.958998 -0.915106 0.588228
C  1.743162 -1.515323 -0.097818
C  1.030821 1.429296 0.990242
C  -0.100918 2.361776 0.530093
C  -1.646225 0.822721 -0.628372
C  -1.908558 0.071288 0.543195
C  -2.298959 0.510718 -1.846064
C  -2.838765 -0.99407 0.488922
C  -3.221655 -0.551919 -1.898354
C  -3.481527 -1.291371 -0.72521
H  3.48094 1.179119 2.435573
H  4.996626 0.644606 1.671791
H  4.326818 2.263083 1.268298
H  5.031437 0.140442 -0.905922
H  3.496687 0.251342 -1.831208
H  4.282525 1.740232 -1.226842
H  0.881337 -1.47201 0.594383
H  1.937613 -2.576551 -0.32155
H  1.460449 -0.972072 -1.014623
H  0.319824 3.346379 0.271797
H  -0.826952 2.462828 1.356921
H  -1.404183 0.282436 1.490691
H  -2.078125 1.109125 -2.734615
H  -3.049991 -1.581311 1.387165
H  -3.73133 -0.797354 -2.83437
