program: Gaussian 09
title: 000239876
version: EM64L-G09RevD.01
frameworkgroup: C1[X(C16H12Cl2O5)]
method: RPBEPBE
basis: SDD
operation: Freq
keyword: #p
keyword: freq=noraman
keyword: PBEPBE/SDD
title: #p freq=noraman PBEPBE/SDD
converged: YES YES NO NO
title: Mulliken charges:
elementType: Cl Cl O O O O O C C C C C C C C C C C C C C C C H H H H H H H H H H H H
charge: -0.037125 -0.066465 -0.261720 -0.256518 -0.268397 -0.248678 -0.208953 0.694333 0.192840 0.196504 -0.521021 -0.465836 -0.330693 -0.329800 -0.201137 -0.430561 0.272514 0.394187 -0.322940 -0.361191 -0.210114 -0.179993 -0.119173 0.265388 0.269599 0.235048 0.282756 0.244426 0.245417 0.273690 0.240496 0.245334 0.258846 0.252218 0.256719
chargesum: 0.00000
title: Mulliken charges with hydrogens summed into heavy atoms:
elementType: Cl Cl O O O O O C C C C C C C C C C C C C C C C
charge: -0.037125 -0.066465 -0.261720 -0.256518 -0.268397 -0.248678 -0.208953 0.694333 0.192840 0.196504 -0.255632 0.038811 -0.330693 -0.047044 0.288706 0.083625 0.272514 0.394187 -0.077606 -0.102345 0.042104 0.076726 -0.119173
polarizability: 3.14189752e+02 1.59391508e+01 2.09948228e+02 3.34309508e+01 -8.05890156e+00 1.12446662e+02
1716.lowfreq: -29.0703 -7.8602 -5.3712 -4.5481 0.0011 0.0011 0.0022 2.1407 16.5298
frequency: -28.9746 -3.9552 16.3814 21.7312 24.5153 45.4725 62.5321 101.5157 105.8840 140.1995 163.1003 178.5285 203.8393 235.7914 247.1236 259.5699 286.9740 301.2153 321.9074 332.5141 350.7399 356.0369 401.7841 415.5655 438.9115 454.4785 497.8558 525.6168 532.9756 548.9058 600.7134 624.8346 641.9618 661.4424 683.3469 689.6163 697.0445 711.5367 758.3080 770.3832 795.5605 801.2456 823.2551 835.4030 839.0722 852.7976 874.8454 888.3763 928.3215 952.5876 953.5174 970.4494 988.8786 994.3220 1002.0070 1023.1983 1064.3378 1071.2944 1077.9226 1098.7678 1109.7197 1119.3242 1168.6701 1174.3106 1201.8993 1203.5457 1237.4077 1248.7524 1269.9875 1289.0548 1332.1152 1346.8842 1362.5654 1373.6432 1392.1431 1403.5499 1422.9088 1449.4573 1468.6841 1472.4216 1474.4924 1486.9749 1586.9735 1604.9527 1606.6788 1624.0351 1670.0675 3008.2213 3021.4347 3025.1949 3083.5666 3093.7500 3103.1720 3151.0548 3161.6376 3172.1884 3173.6216 3181.5127 3196.5639
redmass: 2.2754 9.3003 9.2503 9.5766 6.8725 5.8100 7.4636 8.7324 9.3471 11.0310 9.6248 9.1131 6.4417 8.0234 7.4316 4.3828 3.7356 4.7209 5.0892 7.6033 11.4594 9.0981 4.2064 3.0070 4.1407 4.5279 2.7440 3.6894 5.4861 4.4530 6.8668 7.1615 9.3625 7.5984 9.5784 6.5200 3.6212 4.5808 5.9413 5.9483 5.3087 1.2930 1.5536 5.6877 5.8217 1.4790 2.2167 3.1404 1.3428 1.3460 4.0452 4.0977 3.6723 2.2541 2.3867 6.0528 1.4543 2.5092 3.9253 4.2186 1.3053 1.0368 1.9072 1.1941 1.4312 1.5853 1.2471 1.5504 5.9510 1.2567 1.3148 1.5034 1.3153 6.0909 3.3231 3.8244 7.6510 1.0840 2.6670 2.3544 1.1235 1.2867 7.2825 6.9381 8.4411 9.2898 10.3211 1.0610 1.0536 1.0575 1.1008 1.1078 1.1192 1.0883 1.0885 1.0933 1.0964 1.0978 1.0941
irintensity: 14.7111 0.0958 0.0196 0.2010 0.2195 0.5461 1.0998 0.1218 1.3334 0.5180 1.5867 2.2275 1.4501 0.7604 6.0464 4.2317 6.8492 8.1667 4.3636 2.9111 3.8242 1.5039 1.6751 0.0871 15.3707 11.9003 21.6274 6.9582 1.9602 15.2930 53.9888 3.9223 3.2813 13.5183 3.4049 10.3624 0.3939 0.8643 7.2801 1.0937 12.1507 16.4710 70.3768 25.7481 29.5559 22.2816 69.5621 27.0150 0.2204 0.3567 104.6559 117.8566 43.1857 44.0892 20.8993 210.3755 4.5682 40.1798 39.8635 487.9768 8.2151 0.0537 41.6585 39.1699 35.9109 71.7011 22.0973 51.1664 173.1115 0.6722 7.7886 18.8784 1.9157 7.3761 56.6546 0.5738 26.4533 25.5801 233.2226 187.0097 17.4670 31.9139 10.8227 17.0735 1.4569 15.1589 201.6613 27.7285 116.6617 19.7474 6.0689 11.6397 26.8979 12.0246 2.1760 1.0949 5.6198 1.6714 1.2074
temp: 298.150 k
press: 1.00000 atm
elementType: 17 17 8 8 8 8 8 6 6 6 6 6 6 6 6 6 6 6 6 6 6 6 6 1 1 1 1 1 1 1 1 1 1 1 1
symmnumber: 1
zpe: 644309.6 jmol-1
zpe.correction: 0.245405 hartree
zpe.thermalcorrener: 0.264705 hartree
zpe.thermalcorrenthalpy: 0.265649 hartree
zpe.thermalcorrgfe: 0.194042 hartree
zpe.sumelectzpe: -1911.445898 hartree
zpe.sumelectthermal: -1911.426597 hartree
zpe.sumelectthermalent: -1911.425653 hartree
zpe.sumelectthermalfe: -1911.497260 hartree
dipole: -5.9652 -2.2066 -1.7612
dipole: 6.5996
quadrupole: -139.2148 -144.5641 -148.2978
quadrupole: 15.2970 -0.9035 -3.6728
quadrupole: 4.8108 -0.5385 -4.2723 15.2970 -0.9035 -3.6728
hfenergy: -1911.6913022 hartree
pointgroup: C01 [X(C16H12Cl2O5)]
dipole: -2.3544707 1.0167256 0.405613 debye
polarizability: 313.6801981|-25.5111813|192.1046126|-29.6822505|-37.6776773|130.7998314 unknown
InChI: InChI=1S/C16H12Cl2O5/c17-11-1-3-12(4-2-11)20-8-16(19)21-7-10-5-14-15(6-13(10)18)23-9-22-14/h1-6H,7-9H2
charge 0 multiplicity 1
35 atoms
Cl -2.203675 -2.686773 0.373354
Cl 7.575902 1.695452 -1.301659
O  -5.381298 2.276008 -0.674263
O  -6.416478 0.497745 0.571989
O  -0.106344 -0.081068 -0.057844
O  3.046189 -1.248347 1.383334
O  1.329645 -1.728886 -0.909756
C  -2.457868 -0.114421 -0.722795
C  -4.487509 1.190993 -0.518339
C  -5.097747 0.149933 0.21355
C  -3.18135 1.086821 -0.992923
C  -1.045573 -0.258901 -1.224191
C  -3.101902 -1.139314 0.013694
C  -4.427654 -1.040899 0.501954
C  -6.626251 1.875315 0.037379
C  1.682511 -0.748744 1.353667
C  1.001301 -0.9358 -0.009478
C  4.037614 -0.50484 0.712738
C  3.806841 0.711227 0.025245
C  5.341494 -1.052055 0.783669
C  4.890696 1.380408 -0.590071
C  6.420267 -0.38641 0.170801
C  6.179482 0.826542 -0.50801
H  -2.715098 1.901399 -1.553604
H  -0.840755 -1.249467 -1.66702
H  -0.794143 0.529302 -1.952827
H  -4.895951 -1.849075 1.066174
H  -6.796391 2.56392 0.882412
H  -7.461967 1.854842 -0.681601
H  1.137242 -1.363123 2.090487
H  1.61401 0.310568 1.664604
H  2.807288 1.149338 -0.053217
H  5.490338 -1.995476 1.31638
H  4.724379 2.31905 -1.126303
H  7.429555 -0.804665 0.220072
