program: Gaussian 09
title: 000239828
version: EM64L-G09RevD.01
frameworkgroup: C1[X(C5H11NO2)]
method: RPBEPBE
basis: SDD
operation: Freq
keyword: #p
keyword: freq=noraman
keyword: PBEPBE/SDD
title: #p freq=noraman PBEPBE/SDD
converged: YES YES NO NO
title: Mulliken charges:
elementType: O O N C C C C C H H H H H H H H H H H
charge: -0.416933 -0.238079 -0.084944 -0.334588 -0.485295 -0.620546 -0.613038 0.182783 0.189714 0.241042 0.253230 0.267785 0.229994 0.188253 0.223761 0.222262 0.189671 0.229246 0.375681
chargesum: 0.00000
title: Mulliken charges with hydrogens summed into heavy atoms:
elementType: O O N C C C C C
charge: -0.041252 -0.238079 -0.084944 0.096168 0.035720 0.021463 0.028140 0.182783
polarizability: 8.42210834e+01 8.82830104e-01 6.80275288e+01 8.64204748e-01 -1.89241303e+00 5.14468292e+01
1716.lowfreq: -8.8566 -2.7184 0.0010 0.0012 0.0012 8.8502 29.6663 67.7417 102.3330
frequency: 29.4116 67.5017 102.2394 129.7007 223.5072 237.0227 263.5693 318.0599 350.5642 441.9593 477.0744 516.9106 583.7557 644.9719 788.2281 808.0398 884.8041 1009.6898 1033.0175 1043.3636 1063.7252 1082.0861 1095.7027 1132.3051 1164.7230 1215.2762 1247.2737 1270.5377 1295.1645 1332.3640 1387.5171 1419.6379 1440.2473 1444.5879 1462.5795 1467.2955 1476.1992 1479.2264 1486.2881 1665.9527 2849.3005 2850.3154 2869.1755 2999.3574 3021.5873 3028.0945 3045.0831 3068.2841 3080.3760 3084.1865 3511.5064
redmass: 4.8435 2.9326 2.0738 3.4496 1.1971 1.1687 2.8342 2.9028 2.5334 2.3703 2.7405 2.0389 4.2112 1.3875 1.4052 4.2761 4.0106 2.7511 1.4914 1.9202 2.2040 1.6473 1.6542 1.3655 1.5699 1.7040 1.6703 2.6664 1.2421 1.8220 1.5212 1.1460 1.1025 1.1547 1.0478 1.0618 1.0579 1.0743 1.0556 8.1110 1.0579 1.0669 1.0602 1.0623 1.0727 1.0722 1.0886 1.0967 1.1007 1.1005 1.0639
irintensity: 1.2563 0.1703 0.7058 3.5158 0.5416 0.9075 2.0440 5.5656 6.3448 0.9138 16.4852 44.7492 31.8306 125.0688 3.8492 15.6025 11.8465 186.7289 7.4735 22.2258 74.6869 48.4376 12.0374 8.2518 13.1175 17.9571 4.4131 5.4174 12.9992 51.7317 42.7345 4.2790 28.0831 2.9936 18.0634 1.3236 8.1634 23.2185 19.6753 211.2297 70.8659 54.3162 223.6400 10.7100 41.4130 45.6144 3.7158 15.1510 29.4651 51.1583 18.4229
temp: 298.150 k
press: 1.00000 atm
elementType: 8 8 7 6 6 6 6 6 1 1 1 1 1 1 1 1 1 1 1
symmnumber: 1
zpe: 418629.3 jmol-1
zpe.correction: 0.159447 hartree
zpe.thermalcorrener: 0.169210 hartree
zpe.thermalcorrenthalpy: 0.170155 hartree
zpe.thermalcorrgfe: 0.123617 hartree
zpe.sumelectzpe: -401.652760 hartree
zpe.sumelectthermal: -401.642997 hartree
zpe.sumelectthermalent: -401.642052 hartree
zpe.sumelectthermalfe: -401.688590 hartree
dipole: -0.7341 1.2103 0.4330
dipole: 1.4803
quadrupole: -41.9594 -53.2332 -50.6708
quadrupole: 2.7609 -1.6850 1.9356
quadrupole: 6.6618 -4.6120 -2.0497 2.7609 -1.6850 1.9356
hfenergy: -401.8122071 hartree
pointgroup: C01 [X(C5H11N1O2)]
dipole: -0.2729334 -0.4508705 -0.2478128 debye
dipolederiv: -0.963449 0.5577344 -0.0493119 0.4960385 -0.6636722 0.0219166 -0.0325087 0.0154987 -0.4320632 -0.6948665 -0.174019 0.0020694 0.0624419 -0.9637902 0.0586565 -0.0070688 0.0599042 -0.3165667 -0.6423091 0.0390595 -0.0452623 0.0201431 -0.4970296 0.0214713 -0.0045567 0.0126099 -0.5776063 0.5190554 0.0985906 -0.0573942 0.0601736 0.091226 -0.0909608 -0.0455164 -0.088881 0.408122 -0.3688273 -0.0707981 0.011437 -0.1881796 -0.0738618 0.0541179 0.1219447 0.0849619 0.099943 0.0893891 0.0756145 0.0803111 0.0882122 0.2991877 0.066672 0.106914 0.056458 0.4450735 0.2913189 -0.1931442 0.0191494 -0.2513398 0.2845601 -0.0886266 0.0079008 -0.0838557 0.3242221 1.5299054 -0.1788427 0.0060847 -0.2572765 1.3864768 -0.1130048 -0.006215 -0.1108235 0.2076662 -0.0668663 -0.0041624 -0.0209967 -0.0110432 0.0309182 0.0554651 0.1103647 0.1144974 -0.2409614 0.0791143 -0.0184342 0.0030267 -0.0229766 -0.0719016 -0.0753368 -0.0150063 -0.0845034 0.0217907 0.0951313 0.0024237 0.0061507 0.0404976 -0.0348802 -0.0750599 -0.0232481 -0.0989648 0.0487966 0.1086734 -0.0177586 0.0176934 0.0302647 0.0936976 0.0449943 -0.0500891 0.0522058 -0.0419707 0.0012539 0.1780205 -0.0141955 0.1377816 -0.0653286 -0.0034563 -0.030435 -0.0054519 0.057162 0.0573163 -0.0323603 -0.0183394 -0.0077324 -0.010251 0.0975176 -0.0923898 -0.0782807 -0.3015516 -0.1436797 -0.132446 0.045474 -0.0633935 0.0736019 0.0080527 0.0766104 0.0193399 0.049702 -0.1560073 -0.0322427 0.0754979 -0.1084226 0.0485875 0.0565649 0.0639261 0.046852 0.0701409 -0.012338 0.0738482 0.0043625 0.1248354 -0.0445816 0.06537 -0.145876 0.1904142 -0.2104048 0.0859316 -0.0676469 -0.0708141 0.0067906 -0.0833125 -0.1175056 -0.0446661 -0.1135438 -0.0020145 0.1912536 -0.1034365 0.0050573 -0.1568152 0.2003536 0.0131518 0.0099153 0.0115628 0.39052 unknown
polarizability: 84.2528183|-0.6194915|68.2157709|0.5934157|0.4097141|51.2268523 unknown
InChI: InChI=1S/C5H11NO2/c1-6(2)4-3-5(7)8/h7H,3-4H2,1-2H3
charge 0 multiplicity 1
19 atoms
O  2.990937 -0.822161 0.18911
O  2.209805 1.356848 0.026402
N  -1.863003 -0.115068 0.216251
C  -0.539711 0.43634 -0.155172
C  0.603415 -0.523576 0.22409
C  -2.254732 -1.288728 -0.591454
C  -2.912779 0.925884 0.208448
C  1.96337 0.134475 0.127673
H  -0.474471 0.683571 -1.246177
H  -0.392164 1.384624 0.391671
H  0.618182 -1.437766 -0.395121
H  0.4546 -0.85903 1.26976
H  -1.525624 -2.107674 -0.465436
H  -2.33665 -1.0611 -1.685519
H  -3.235235 -1.661108 -0.245392
H  -3.861317 0.497061 0.578468
H  -3.103823 1.359129 -0.806322
H  -2.62419 1.750907 0.883477
H  3.870789 -0.356327 0.157444
