program: Gaussian 09
title: 000239825
version: EM64L-G09RevD.01
frameworkgroup: C1[X(C8H19NO)]
method: RPBEPBE
basis: SDD
operation: Freq
keyword: #p
keyword: freq=noraman
keyword: PBEPBE/SDD
title: #p freq=noraman PBEPBE/SDD
converged: YES YES NO NO
title: Mulliken charges:
elementType: O N C C C C C C C C H H H H H H H H H H H H H H H H H H H
charge: -0.433135 -0.109497 -0.044314 -0.402773 -0.044005 -0.388317 -0.717409 -0.686170 -0.621606 -0.636359 0.184030 0.195379 0.219894 0.192137 0.226007 0.195789 0.193887 0.220438 0.214433 0.195521 0.226355 0.212093 0.218448 0.187451 0.223884 0.223209 0.195284 0.227385 0.331962
chargesum: 0.00000
title: Mulliken charges with hydrogens summed into heavy atoms:
elementType: O N C C C C C C C C
charge: -0.101173 -0.109497 0.139716 0.012500 0.148132 0.033479 -0.088651 -0.052201 0.008177 0.009519
polarizability: 1.06066695e+02 -3.98516595e+00 9.71975438e+01 -1.58875312e+00 4.54285148e-01 8.86138320e+01
1716.lowfreq: -7.9158 -0.0012 -0.0007 -0.0006 12.9152 14.6654 17.6439 75.2238 80.5804
frequency: 13.6246 75.0960 80.4340 119.0156 140.6694 188.8625 203.1967 220.8114 232.0666 234.4105 247.3499 268.6792 304.2712 340.5575 369.3461 370.8028 406.9467 468.2072 509.7129 558.4274 756.3899 780.2083 868.2995 894.0744 920.5364 950.0688 959.4929 970.3672 1005.6570 1030.8290 1042.7687 1069.5175 1086.3074 1111.6727 1119.8201 1135.3526 1157.7953 1190.8043 1194.3844 1253.0980 1276.8207 1298.4347 1299.2583 1322.2725 1334.0137 1359.4821 1366.3890 1374.3309 1376.3569 1393.6710 1421.5292 1441.1421 1452.1020 1456.4291 1461.3671 1463.4107 1469.8519 1472.6214 1483.3137 1484.1272 1486.1297 1496.2971 2850.8346 2866.2441 2951.1113 2953.9591 2958.8738 2964.7487 2972.6977 2984.2726 3002.9292 3011.1907 3037.8429 3054.1002 3062.8911 3064.9688 3069.5074 3070.0076 3076.3413 3079.0804 3552.9116
redmass: 2.9674 2.7157 2.5938 2.4953 2.9207 1.2123 1.2869 1.3833 1.8185 1.1974 1.4274 2.2261 1.3733 2.2695 2.0969 2.4246 2.2581 2.7985 2.9667 2.3758 2.8958 2.7673 2.0117 1.6107 1.2997 3.1219 1.5729 2.4349 1.9108 2.0695 1.6445 1.7725 1.2546 1.4061 2.0161 1.4262 1.8300 2.0358 1.9631 1.5659 1.7093 1.3599 1.3672 1.4134 1.4315 1.2937 1.3348 1.2930 1.2187 1.2193 1.1378 1.1400 1.0809 1.0557 1.0558 1.0463 1.0793 1.0643 1.0543 1.0533 1.0562 1.0547 1.0567 1.0576 1.0792 1.0808 1.0676 1.0372 1.0366 1.0622 1.0719 1.0746 1.1012 1.0982 1.1002 1.0999 1.0994 1.0962 1.0988 1.0974 1.0660
irintensity: 0.1991 0.2364 0.7579 2.6163 2.1380 0.2883 0.0640 2.9631 4.3804 2.5858 1.2450 43.5069 87.4759 42.6366 1.1279 0.5340 22.5887 3.8538 5.2226 14.8416 3.4650 0.8589 9.3535 4.9825 2.0226 62.4898 1.6542 41.3650 16.4184 8.5707 8.9669 12.0977 8.6879 41.1015 2.2639 0.7037 7.4579 11.2095 10.8841 3.4332 8.1338 17.7880 3.1032 3.8275 2.2961 9.5166 1.5698 5.4706 20.0765 16.0422 7.7152 7.8471 2.8745 10.7094 5.8016 1.6278 7.5433 8.0711 20.7109 16.7245 12.8122 6.5116 92.1719 160.2535 16.2454 41.6598 64.9813 43.0528 38.4889 32.2957 48.0659 44.6482 26.7215 44.4526 22.0083 42.2065 79.3202 27.8879 49.1798 46.6967 6.1082
temp: 298.150 k
press: 1.00000 atm
elementType: 8 7 6 6 6 6 6 6 6 6 1 1 1 1 1 1 1 1 1 1 1 1 1 1 1 1 1 1 1
symmnumber: 1
zpe: 684406.3 jmol-1
zpe.correction: 0.260677 hartree
zpe.thermalcorrener: 0.274318 hartree
zpe.thermalcorrenthalpy: 0.275262 hartree
zpe.thermalcorrgfe: 0.220337 hartree
zpe.sumelectzpe: -445.322921 hartree
zpe.sumelectthermal: -445.309280 hartree
zpe.sumelectthermalent: -445.308335 hartree
zpe.sumelectthermalfe: -445.363261 hartree
dipole: 0.7630 -1.0814 1.1075
dipole: 1.7258
quadrupole: -62.5478 -73.9786 -61.4502
quadrupole: -2.4682 0.0040 3.9133
quadrupole: 3.4444 -7.9864 4.5420 -2.4682 0.0040 3.9133
hfenergy: -445.5835972 hartree
pointgroup: C01 [X(C8H19N1O1)]
dipole: 0.1101184 0.5704512 -0.3513657 debye
polarizability: 101.0338581|5.5227614|101.3424387|2.8132395|3.2873488|89.5017742 unknown
InChI: InChI=1S/C8H19NO/c1-7(2)5-8(6-10)9(3)4/h7-8,10H,5-6H2,1-4H3
charge 0 multiplicity 1
29 atoms
O  1.596054 -2.316042 -0.347821
N  0.738333 1.393326 0.136274
C  0.49575 -0.066375 -0.065502
C  -0.640754 -0.618882 0.836125
C  -2.077213 -0.565827 0.237698
C  1.79021 -0.921487 0.087256
C  -2.229087 -1.50401 -0.986194
C  -2.539957 0.870993 -0.100196
C  1.333879 2.084624 -1.021208
C  1.373438 1.78076 1.410141
H  0.175733 -0.165959 -1.125724
H  -0.636789 -0.068117 1.79706
H  -0.408555 -1.677579 1.06742
H  -2.752393 -0.958269 1.028607
H  2.080753 -1.008915 1.147997
H  2.628253 -0.452301 -0.472114
H  -1.636899 -1.145372 -1.850846
H  -1.89551 -2.531186 -0.746009
H  -3.284218 -1.552955 -1.313687
H  -3.578051 0.868291 -0.485077
H  -1.886121 1.330754 -0.862687
H  -2.499557 1.52385 0.790642
H  0.759654 1.845064 -1.935063
H  2.408046 1.833138 -1.21377
H  1.276543 3.178198 -0.864533
H  1.253487 2.870222 1.55998
H  2.467551 1.554841 1.464252
H  0.880772 1.272231 2.25637
H  1.293249 -2.313916 -1.291592
