program: Gaussian 09
title: 000239821
version: EM64L-G09RevD.01
frameworkgroup: C1[X(C11H14N2O3)]
method: RPBEPBE
basis: SDD
operation: Freq
keyword: #p
keyword: freq=noraman
keyword: PBEPBE/SDD
title: #p freq=noraman PBEPBE/SDD
converged: YES YES NO NO
title: Mulliken charges:
elementType: O O O N N C C C C C C C C C C C H H H H H H H H H H H H H H
charge: -0.408938 -0.284376 -0.221966 -0.073944 0.064346 -0.039180 -0.595075 0.509140 -0.708379 -0.484119 -0.410292 -0.395403 -0.229856 -0.230690 0.223100 -0.239654 0.232050 0.247394 0.213239 0.260536 0.231041 0.231099 0.272944 0.301653 0.237652 0.227355 0.227521 0.225719 0.230428 0.386654
chargesum: 0.00000
title: Mulliken charges with hydrogens summed into heavy atoms:
elementType: O O O N N C C C C C C C C C C C
charge: -0.022284 -0.284376 -0.221966 -0.073944 0.064346 0.192871 -0.134443 0.509140 0.014297 0.090478 -0.172640 -0.168048 -0.002335 -0.004971 0.223100 -0.009226
polarizability: 1.75869402e+02 -1.10460421e+01 1.46143299e+02 -1.90059710e+01 -9.46213651e+00 1.01846684e+02
1716.lowfreq: -9.2682 -7.7237 -0.0008 -0.0008 -0.0006 3.8106 18.6487 24.9592 40.9503
frequency: 17.9737 24.8185 40.9297 50.3442 51.9369 67.4264 112.5356 160.7404 208.8859 230.2675 245.8205 269.8662 295.4669 343.5614 352.0129 402.4706 404.1345 447.9548 489.2134 498.8491 524.0453 561.6459 617.2397 627.6203 635.9458 671.7607 705.9211 753.9895 804.8189 824.3941 854.0104 864.5813 885.1183 904.5598 921.1130 928.0318 976.0951 990.2415 996.0819 1009.4437 1026.1025 1046.5908 1047.2992 1082.3024 1103.0804 1135.4259 1164.4054 1173.0251 1187.6160 1215.5127 1226.5502 1245.8048 1281.9259 1296.2051 1305.1981 1329.0384 1334.2063 1354.2922 1380.4618 1383.7259 1389.1175 1429.4538 1440.3753 1470.8154 1474.8440 1483.1511 1488.5208 1592.5061 1614.1161 1672.5980 2958.8721 2989.9654 3001.7425 3015.4070 3044.6012 3061.8193 3105.7491 3108.5788 3109.9923 3120.0452 3133.0959 3144.9710 3163.5635 3519.2279
redmass: 4.5816 5.1665 7.2653 3.9464 4.1910 5.8419 5.5895 5.1283 4.8992 1.5464 1.7936 4.4055 3.8106 6.3699 2.4159 2.8203 2.6705 4.4772 3.7092 2.2204 2.9480 5.2414 6.2843 3.8746 1.6591 3.9274 1.7558 1.9460 4.1514 3.2819 1.2568 2.8150 2.3880 1.6620 1.7103 2.5434 1.3884 6.2493 1.3145 1.9104 2.1924 1.9748 1.9714 2.8756 1.5552 2.1763 1.9972 1.0562 1.1150 2.3784 1.5908 1.5489 1.8040 1.5201 1.3778 1.4359 2.2222 2.5107 2.7733 2.1622 1.2203 1.0927 2.1501 1.0546 1.1061 2.1202 1.0917 6.0275 6.1583 8.5145 1.0628 1.0620 1.0349 1.0854 1.0938 1.1002 1.1003 1.0888 1.1003 1.0867 1.0905 1.0957 1.1014 1.0643
irintensity: 0.5734 0.7291 0.7084 0.6231 2.4004 1.2302 0.4836 1.9559 7.2784 0.2940 2.0189 0.9597 2.7134 1.9235 2.4053 0.0144 6.0943 8.6055 28.3048 37.5132 15.5104 12.3548 0.1217 13.8007 131.4563 4.6559 53.7475 39.6533 8.5248 4.4483 0.0982 3.4406 6.1057 16.3804 25.3428 84.3835 0.0427 0.3061 0.3872 31.6357 5.8285 200.8696 128.4297 46.8434 18.3552 73.3655 2.9245 0.2038 0.1960 0.9186 7.8962 8.0051 5.5231 38.6284 1.5716 20.7567 62.6327 132.7571 2.4039 2.9070 26.9614 42.4733 8.3841 5.0429 8.3876 21.0802 8.3962 1.6421 6.8228 184.9133 48.4526 25.7939 10.7769 9.2778 4.7908 12.3051 20.7452 8.5163 16.4613 5.2033 8.4736 39.4246 23.1719 33.9353
temp: 298.150 k
press: 1.00000 atm
elementType: 8 8 8 7 7 6 6 6 6 6 6 6 6 6 6 6 1 1 1 1 1 1 1 1 1 1 1 1 1 1
symmnumber: 1
zpe: 619807.8 jmol-1
zpe.correction: 0.236072 hartree
zpe.thermalcorrener: 0.252040 hartree
zpe.thermalcorrenthalpy: 0.252984 hartree
zpe.thermalcorrgfe: 0.189323 hartree
zpe.sumelectzpe: -761.488692 hartree
zpe.sumelectthermal: -761.472725 hartree
zpe.sumelectthermalent: -761.471781 hartree
zpe.sumelectthermalfe: -761.535441 hartree
dipole: -1.9674 3.9959 -0.6753
dipole: 4.5048
quadrupole: -91.7828 -94.2814 -98.3779
quadrupole: 13.9294 -3.3698 -3.7922
quadrupole: 3.0313 0.5326 -3.5639 13.9294 -3.3698 -3.7922
hfenergy: -761.7247645 hartree
pointgroup: C01 [X(C11H14N2O3)]
dipole: -0.7613872 1.4652533 0.6438283 debye
polarizability: 174.3011111|1.5846887|142.0002385|-24.3504882|15.8368936|107.5580352 unknown
InChI: InChI=1S/C11H14N2O3/c1-9(13(12-16)8-11(14)15)7-10-5-3-2-4-6-10/h2-6,9,14H,7-8H2,1H3
charge 0 multiplicity 1
30 atoms
O  3.792736 2.188701 0.797421
O  3.060759 -1.626211 -1.971703
O  3.025057 0.232668 1.799777
N  1.661883 -0.44316 -0.656562
N  1.922179 -1.599079 -1.370792
C  0.328744 -0.387095 0.017188
C  -0.800573 -0.306158 -1.061349
C  -2.162773 0.006971 -0.461812
C  0.154192 -1.56284 0.998748
C  2.62009 0.665869 -0.616088
C  -3.128596 -1.01233 -0.261708
C  -2.48834 1.332393 -0.070456
C  -4.384986 -0.718173 0.315293
C  -3.74187 1.631723 0.50751
C  3.136437 0.95209 0.787392
C  -4.695537 0.605397 0.703543
H  0.330501 0.558566 0.591555
H  -0.818446 -1.268243 -1.604617
H  -0.51849 0.477683 -1.791558
H  0.969084 -1.55668 1.741494
H  0.174215 -2.523599 0.456799
H  -0.811345 -1.470437 1.523998
H  2.19517 1.593131 -1.04122
H  3.471578 0.358032 -1.261301
H  -2.894772 -2.040446 -0.564352
H  -1.760007 2.138148 -0.231827
H  -5.120291 -1.518054 0.458103
H  -3.978091 2.66152 0.798747
H  -5.669971 0.83575 1.14841
H  4.165365 2.362062 1.70427
