program: Gaussian 09
title: 000239816
version: EM64L-G09RevD.01
frameworkgroup: C1[X(C6H15NO2)]
method: RPBEPBE
basis: SDD
operation: Freq
keyword: #p
keyword: freq=noraman
keyword: PBEPBE/SDD
title: #p freq=noraman PBEPBE/SDD
converged: YES YES NO NO
title: Mulliken charges:
elementType: O O N C C C C C C H H H H H H H H H H H H H H H
charge: -0.436904 -0.437616 -0.097956 -0.089134 -0.377741 -0.412618 -0.319615 -0.608136 -0.616885 0.218245 0.216862 0.186427 0.257358 0.169365 0.205237 0.211835 0.191580 0.223569 0.224366 0.224954 0.193706 0.226380 0.320314 0.326405
chargesum: 0.00000
title: Mulliken charges with hydrogens summed into heavy atoms:
elementType: O O N C C C C C C
charge: -0.116590 -0.111211 -0.097956 0.129111 0.025548 0.014105 0.097457 0.031379 0.028156
polarizability: 8.86687966e+01 2.06376101e+00 7.52323310e+01 -1.05999016e+00 -1.41461345e+00 7.56412830e+01
1716.lowfreq: -13.4497 -6.3380 -0.0006 -0.0004 0.0005 10.4738 25.5213 66.7668 74.0310
frequency: 24.1728 66.7592 73.9785 107.2755 160.2515 185.5207 210.9372 230.0614 291.6450 297.3775 302.2789 333.8123 368.9707 380.7029 464.3362 480.0955 516.5456 786.8924 821.9425 852.7201 919.3006 953.1031 1017.9967 1032.1695 1034.3038 1049.5718 1068.9879 1088.0009 1101.0245 1120.8628 1141.3524 1156.3584 1250.2445 1252.9573 1263.0114 1277.5034 1294.0457 1320.0221 1359.7074 1365.4842 1371.9701 1381.2004 1420.2758 1442.4345 1457.9974 1462.3945 1462.9321 1474.3896 1475.9146 1482.4772 1485.2609 2854.9072 2860.9754 2875.7171 2941.5062 2977.7653 2990.0313 3019.4547 3028.7183 3040.1218 3048.7740 3074.8682 3077.4946 3084.6132 3537.0676 3561.1836
redmass: 2.7783 3.8392 1.8550 3.0748 2.4580 3.1067 1.1689 1.2189 1.2276 1.3134 2.5491 2.2638 2.2005 2.6893 2.7558 2.3921 3.4229 1.3398 4.3905 2.1639 1.8549 5.4061 1.7183 1.9330 1.8755 2.4662 2.2811 1.2745 1.4419 1.5542 1.5928 1.6698 1.5668 1.3626 2.4472 1.5898 1.1720 1.2653 1.4270 1.4055 1.2000 1.2490 1.1400 1.1552 1.0739 1.0531 1.0760 1.0665 1.0603 1.0858 1.0540 1.0568 1.0620 1.0617 1.0679 1.0656 1.0892 1.0730 1.0736 1.0848 1.0910 1.1008 1.1010 1.1007 1.0658 1.0662
irintensity: 0.4682 1.4257 5.9167 6.2746 1.0558 2.5246 0.4836 0.9206 54.6880 170.2582 20.9890 55.8075 15.0242 8.5019 9.2739 9.1651 21.0805 0.6062 19.0253 19.0185 43.6390 69.3530 8.4352 54.2587 34.8559 31.3477 34.4673 7.7132 30.5528 2.1300 13.8138 7.5897 20.0709 21.3359 7.6216 9.8657 2.2470 16.5546 5.6815 9.1016 17.2919 23.6312 3.3185 2.7888 0.8534 20.0940 2.9678 10.1849 22.8903 5.3591 13.5572 69.9931 63.6203 219.9160 27.4114 49.4141 24.3405 39.4375 35.3022 30.1075 11.6231 37.6151 46.6207 41.8851 4.2798 5.6062
temp: 298.150 k
press: 1.00000 atm
elementType: 8 8 7 6 6 6 6 6 6 1 1 1 1 1 1 1 1 1 1 1 1 1 1 1
symmnumber: 1
zpe: 549760.2 jmol-1
zpe.correction: 0.209393 hartree
zpe.thermalcorrener: 0.221460 hartree
zpe.thermalcorrenthalpy: 0.222404 hartree
zpe.thermalcorrgfe: 0.170674 hartree
zpe.sumelectzpe: -442.014588 hartree
zpe.sumelectthermal: -442.002520 hartree
zpe.sumelectthermalent: -442.001576 hartree
zpe.sumelectthermalfe: -442.053307 hartree
dipole: -2.4620 0.7559 -2.1195
dipole: 3.3354
quadrupole: -59.8118 -65.5779 -50.9445
quadrupole: 5.4783 -5.9855 -3.7085
quadrupole: -1.0337 -6.7998 7.8336 5.4783 -5.9855 -3.7085
hfenergy: -442.2239805 hartree
pointgroup: C01 [X(C6H15N1O2)]
dipole: 1.018111 0.3336901 0.7577015 debye
dipolederiv: -0.7391982 0.0599834 0.0553918 0.0562615 -0.7940142 0.0029467 0.0711512 -0.0205682 -0.1037536 -0.8727282 -0.1234023 0.0649331 -0.1565104 -0.5116215 0.2396698 0.1130214 0.2697106 -0.2747221 -0.6971734 0.0162766 0.0152318 0.035524 -0.5280028 0.0313571 0.0205819 0.0160066 -0.5095227 0.4367177 -0.0658228 -0.0572953 -0.0341096 0.605341 0.0263083 -0.1130662 0.0329578 0.2531604 0.2358144 -0.0661452 -0.1138233 -0.1196163 0.416661 -0.0424201 -0.1219051 -0.0053493 0.1574398 -0.2931098 -0.1206534 0.0297671 -0.0511812 -0.1271682 0.0913399 -0.0440806 0.1253623 0.0805772 0.6044883 0.1571311 -0.1017909 0.093413 0.4330965 -0.1247779 -0.0803373 -0.1266934 0.3482321 0.4926679 0.0738842 0.1278375 0.0889041 0.2230486 -0.0815056 0.1890422 -0.0927611 0.2147625 0.2223178 0.1190092 -0.1481067 0.1343783 0.2170112 -0.0027619 -0.1922008 0.0037684 0.4027208 0.0663801 0.0041741 -0.0151852 -0.013898 0.0130357 -0.0323258 0.0157352 -0.0367842 -0.1389069 -0.1086345 -0.1340748 0.062899 -0.0294097 -0.1868205 0.0430457 0.0481939 0.130139 0.0172689 0.0559061 0.0294885 0.0284284 0.0286385 0.0319759 -0.0340017 0.0107381 -0.0757223 -0.1738373 0.118251 0.0577367 -0.0216841 0.08848 -0.0630891 0.0025706 -0.0367942 -0.0148539 0.076149 0.0276331 -0.0330221 0.0162608 0.0049177 0.0422233 -0.0937739 0.0211401 -0.0589011 -0.1812348 -0.0407598 0.0642844 0.007958 0.0961186 -0.1599935 0.0642643 0.0145965 0.0088893 0.0502211 0.0528616 -0.0159051 0.0455789 -0.0147761 0.0419432 -0.0632809 0.0204141 -0.034262 -0.1348532 -0.2342676 -0.0870156 -0.0699641 -0.238875 -0.0713414 0.0130656 0.0345423 0.0802447 0.0240147 -0.0037957 0.0840271 -0.0237761 0.129133 -0.1352828 -0.0125598 0.0240242 -0.0585555 0.1020216 0.0538021 0.0009917 0.0794276 -0.0207628 0.1049535 -0.0528065 0.0188527 -0.0067099 -0.1702284 0.0324569 0.1100969 0.066418 0.1124582 -0.1225948 -0.0523488 0.0153394 0.0030016 0.0757471 -0.0827136 -0.1041131 0.163373 -0.1832902 -0.0782656 0.1459145 0.0773567 0.0002054 -0.0833897 -0.0898747 -0.0185538 -0.14317 -0.01261 0.1090364 0.0400748 -0.110155 0.0074928 -0.0189112 0.3623849 0.0176449 -0.0473223 0.034659 0.3165287 0.0427531 -0.020235 -0.0350176 -0.0387379 0.4005734 -0.0260207 -0.0213867 -0.0278463 0.2233393 -0.1507475 0.0240443 -0.1115998 0.0257825 unknown
polarizability: 88.4931739|-2.0328488|75.3663986|-1.7724832|1.5579254|75.6828382 unknown
InChI: InChI=1S/C6H15NO2/c1-7(2)5-6(9)3-4-8/h6,8-9H,3-5H2,1-2H3
charge 0 multiplicity 1
24 atoms
O  -0.848056 2.193267 -0.115091
O  -3.413033 -1.364543 0.487852
N  1.850344 -0.4885 -0.018749
C  -0.304262 0.822057 -0.266874
C  1.166809 0.80278 0.217759
C  -1.181756 -0.225323 0.442531
C  -2.577256 -0.357732 -0.19247
C  3.042752 -0.662584 0.836441
C  2.159053 -0.726974 -1.444345
H  -0.348464 0.668108 -1.360224
H  1.694579 1.663321 -0.266151
H  1.171427 0.991728 1.311512
H  -0.659135 -1.199276 0.410835
H  -1.27788 0.054712 1.516048
H  -3.083658 0.629093 -0.220725
H  -2.495016 -0.73447 -1.226552
H  3.853035 0.082064 0.630319
H  3.464223 -1.672193 0.681994
H  2.757264 -0.57234 1.899786
H  2.617001 -1.725525 -1.558424
H  2.863611 0.030795 -1.871991
H  1.236027 -0.712773 -2.048927
H  -0.859174 2.417188 0.851525
H  -3.538234 -1.088083 1.430721
