program: Gaussian 09
title: 000239815
version: EM64L-G09RevD.01
frameworkgroup: C1[X(C7H15NO2)]
method: RPBEPBE
basis: SDD
operation: Freq
keyword: #p
keyword: freq=noraman
keyword: PBEPBE/SDD
title: #p freq=noraman PBEPBE/SDD
converged: YES YES NO NO
title: Mulliken charges:
elementType: O O N C C C C C C C H H H H H H H H H H H H H H H
charge: -0.424142 -0.228112 -0.110183 -0.065801 -0.330594 -0.688177 -0.701420 -0.399662 -0.651721 0.218412 0.202360 0.179308 0.207049 0.199412 0.204136 0.243856 0.205499 0.217965 0.209790 0.232765 0.214429 0.230692 0.264138 0.191035 0.378965
chargesum: 0.00000
title: Mulliken charges with hydrogens summed into heavy atoms:
elementType: O O N C C C C C C C
charge: -0.045177 -0.228112 -0.110183 0.136558 0.055763 -0.040772 -0.068166 0.047532 0.034145 0.218412
polarizability: 1.05745097e+02 1.81652988e+00 8.70634504e+01 -4.24837742e+00 1.24421344e+00 7.82337596e+01
1716.lowfreq: -10.8663 -5.2815 -0.0008 -0.0006 -0.0004 9.5740 30.7745 36.0169 48.9940
frequency: 30.5369 34.5886 48.8194 114.4429 131.8148 195.5491 198.6921 204.5168 231.6189 276.7003 324.0060 350.0586 366.1502 406.5897 435.2772 467.9428 542.5505 615.6129 699.9367 804.1595 823.6097 842.0931 906.3347 922.1034 941.2839 951.8758 961.7626 1033.9840 1070.6150 1106.9173 1109.6744 1138.7942 1173.5255 1184.8555 1215.0848 1267.7554 1281.7687 1304.4475 1321.3592 1336.3177 1340.5482 1373.9756 1376.8260 1396.0119 1433.3930 1446.3485 1460.5761 1466.0129 1471.9632 1476.5401 1480.4384 1485.0411 1489.8376 1671.5353 2835.4598 2865.3816 2913.5655 2967.4981 2972.1165 2974.1474 3014.3982 3042.0901 3059.3703 3066.8526 3072.9824 3083.8249 3087.1273 3101.9511 3501.8262
redmass: 4.5303 4.2999 3.7424 2.3804 2.7711 3.1272 1.0574 1.1865 1.0912 2.9885 3.4237 2.6057 2.2193 2.1044 2.1417 2.4611 3.9233 1.3721 3.4318 3.1375 5.5075 3.3984 1.3844 1.2067 1.8973 1.7876 1.5931 2.1665 1.9427 1.5839 1.7070 2.1210 1.6902 1.7836 2.0882 1.8650 1.3381 1.4657 1.6828 1.4616 1.4173 1.2569 1.2933 1.2336 1.1462 1.0803 1.0730 1.0561 1.0621 1.0538 1.0469 1.0488 1.0557 8.5484 1.0699 1.0569 1.0693 1.0358 1.0807 1.0374 1.0895 1.0735 1.0995 1.0990 1.0987 1.0910 1.0991 1.1004 1.0638
irintensity: 0.0874 1.0382 0.1768 0.1719 0.3950 1.7239 0.1550 0.4963 0.1781 2.1213 3.4240 0.8231 4.7664 2.9100 4.7599 13.1602 38.9972 93.8079 79.2870 7.6061 21.8666 23.6607 1.3120 3.8212 13.5436 17.9521 2.1488 122.6431 177.2968 11.1732 12.3931 2.9829 8.4513 4.8751 1.0612 1.0054 2.2372 6.0961 30.3608 4.9139 3.4118 19.3267 4.9506 18.4286 11.9102 5.9664 3.3258 2.2094 7.6832 8.9815 10.8436 13.1975 29.3802 234.4011 100.6178 122.6896 94.4614 39.5971 7.3133 32.5923 28.7597 30.2517 25.2613 49.5435 69.1476 13.9600 29.9071 14.1300 15.7392
temp: 298.150 k
press: 1.00000 atm
elementType: 8 8 7 6 6 6 6 6 6 6 1 1 1 1 1 1 1 1 1 1 1 1 1 1 1
symmnumber: 1
zpe: 564047.4 jmol-1
zpe.correction: 0.214834 hartree
zpe.thermalcorrener: 0.227438 hartree
zpe.thermalcorrenthalpy: 0.228382 hartree
zpe.thermalcorrgfe: 0.174861 hartree
zpe.sumelectzpe: -480.095603 hartree
zpe.sumelectthermal: -480.083000 hartree
zpe.sumelectthermalent: -480.082055 hartree
zpe.sumelectthermalfe: -480.135576 hartree
dipole: 0.6544 2.1707 -0.1352
dipole: 2.2712
quadrupole: -59.6338 -68.1294 -59.3217
quadrupole: -3.6089 -3.1976 -0.4368
quadrupole: 2.7279 -5.7678 3.0399 -3.6089 -3.1976 -0.4368
hfenergy: -480.3104372 hartree
pointgroup: C01 [X(C7H15N1O2)]
dipole: 0.2032446 -0.6959035 -0.522345 debye
dipolederiv: -0.7237965 -0.1234825 -0.3956652 -0.0452316 -0.2835278 0.0140064 -0.3873514 -0.0792549 -0.9069367 -0.5165942 0.1918153 0.0571298 0.2197061 -0.6830398 -0.4165759 -0.054181 -0.1935668 -0.7321614 -0.7979927 0.0579563 -0.0011897 -0.0391735 -0.540232 -0.0242838 0.011053 -0.0299917 -0.4606262 0.0347904 0.0035368 -0.0094389 0.0222608 0.0910969 0.0224205 -0.0096432 0.0245197 0.1407041 0.6105303 -0.1002969 0.1253211 -0.0340459 0.3337392 0.0012374 0.2084792 -0.0352109 0.1186877 -0.0255386 0.0253423 -0.0233166 0.0315588 -0.0941815 0.0116618 -0.0073917 0.0266788 0.0838197 -0.0644239 0.0258266 -0.0481286 -0.0140216 0.0385483 0.0320279 -0.0021115 0.0210355 0.0787274 0.3385188 0.1835408 -0.1766803 0.052007 0.2935892 0.0137507 -0.1911422 -0.0746673 0.140417 -0.0432023 0.0020611 0.0030915 0.0579992 0.4172393 0.1069902 -0.0232432 0.1464054 0.3388961 0.9183764 -0.3321666 0.3576527 -0.3888855 0.7240229 0.4561005 0.404126 0.3847344 1.2266984 0.0632375 0.0090467 -0.0134145 -0.0127701 -0.0039824 -0.0693218 -0.0024786 -0.067082 -0.1792037 -0.117439 0.0356562 -0.0302382 0.147064 -0.2889061 0.0602376 -0.0183608 -0.0063881 0.0493099 0.0387213 0.0018345 0.0058552 0.0211377 0.0568982 -0.0763533 -0.0167219 -0.0393445 -0.1449914 0.0955952 -0.0043018 -0.004471 -0.0001836 0.0443762 -0.0253531 -0.0181212 -0.1013623 -0.1516982 -0.071666 -0.1307322 0.107859 -0.0982166 -0.0108178 0.0511085 0.1080706 0.0740798 0.0249976 -0.0559724 0.1125219 -0.0895817 0.1015381 0.0810892 0.0111504 -0.0885926 0.02307 0.0487848 0.0697298 0.0206644 0.0400429 0.0049233 0.0692945 -0.0795121 -0.0474379 -0.0500661 -0.1595168 -0.1240211 -0.077805 0.0614288 -0.1219799 0.0432858 0.0550397 0.0939256 0.0538704 0.03854 0.0842319 0.0242409 -0.0152569 0.0887141 -0.1933864 -0.0000094 -0.0167838 -0.0115237 0.0804639 0.0569447 0.026884 -0.0601925 0.0188256 0.0833548 -0.0284222 -0.0250477 0.0124756 -0.0802955 -0.0933297 -0.0832301 0.0500781 -0.1686183 -0.1526439 0.024977 -0.000295 -0.080298 0.0769559 -0.0048519 -0.051792 0.1695826 -0.0694826 0.0229201 0.0422563 0.1322932 0.0402569 -0.0122188 -0.0383252 0.0117637 -0.12064 0.0325393 0.0799274 0.006189 -0.0786903 0.0152212 0.0881352 0.065475 0.0533925 0.0187272 0.0171144 -0.2867437 -0.1436392 0.011416 0.0126511 -0.0249372 0.3010021 0.1177231 -0.0085545 0.1772207 0.1580796 -0.0456832 0.0182305 -0.0662424 0.3174478 unknown
polarizability: 105.4379769|-5.0751639|82.5704189|1.3734285|4.6596966|83.0339112 unknown
InChI: InChI=1S/C7H15NO2/c1-6(2)4-8(3)5-7(9)10/h6,9H,4-5H2,1-3H3
charge 0 multiplicity 1
25 atoms
O  -3.032131 0.22701 -0.575966
O  -2.4598 1.2646 1.420165
N  -0.071678 -0.440629 -0.183326
C  2.424836 0.040541 -0.259221
C  1.254636 -0.718316 0.419515
C  2.210719 1.568389 -0.196519
C  3.757773 -0.374054 0.407647
C  -1.218419 -0.761845 0.697522
C  -0.232736 -0.949211 -1.55965
C  -2.271661 0.340691 0.60162
H  2.473188 -0.26363 -1.325267
H  1.486521 -1.815945 0.409211
H  1.218451 -0.401706 1.480321
H  2.23968 1.92107 0.852682
H  2.997908 2.104857 -0.758014
H  1.225301 1.839907 -0.61341
H  3.765186 -0.090643 1.478116
H  4.613631 0.129629 -0.077569
H  3.92433 -1.466262 0.342646
H  -0.883192 -0.780714 1.746986
H  -1.686042 -1.745542 0.462299
H  0.511369 -0.482978 -2.227419
H  -1.235707 -0.687984 -1.93368
H  -0.1104 -2.059848 -1.623691
H  -3.664159 0.995117 -0.631795
