program: Gaussian 09
title: 000239809
version: EM64L-G09RevD.01
frameworkgroup: C1[X(C16H17NO2)]
method: RPBEPBE
basis: SDD
operation: Freq
keyword: #p
keyword: freq=noraman
keyword: PBEPBE/SDD
title: #p freq=noraman PBEPBE/SDD
converged: YES YES NO NO
title: Mulliken charges:
elementType: O O N C C C C C C C C C C C C C C C C H H H H H H H H H H H H H H H H H
charge: -0.254860 -0.435313 -0.278569 -0.403647 -0.647566 0.185668 0.499062 0.417492 -0.301265 -0.336618 -0.385506 -0.442127 -0.371816 -0.219982 -0.214925 -0.242828 -0.232495 -0.226717 -0.245109 0.220745 0.229947 0.224055 0.253287 0.210423 0.220240 0.257853 0.233702 0.265825 0.283044 0.229592 0.227926 0.231526 0.230257 0.226593 0.228744 0.363363
chargesum: 0.00000
title: Mulliken charges with hydrogens summed into heavy atoms:
elementType: O O N C C C C C C C C C C C C C C C C
charge: -0.254860 -0.071950 -0.278569 0.047045 -0.170224 0.185668 0.499062 0.417492 0.129398 -0.078765 -0.151805 -0.176302 -0.088772 0.009610 0.013001 -0.011302 -0.002238 -0.000124 -0.016365
polarizability: 2.36512969e+02 1.46569805e+00 1.73077049e+02 1.47249093e+01 1.68267595e+01 1.31465382e+02
1716.lowfreq: -6.1706 -0.0009 -0.0009 -0.0008 4.9437 6.7593 23.0212 25.7432 40.6304
frequency: 22.9287 25.6109 40.6133 43.1844 78.3648 88.0931 110.9727 126.5950 149.3719 210.7932 232.8220 254.7406 299.2332 323.0475 382.8802 396.8305 401.4167 406.9973 414.5819 465.9398 491.7160 498.3448 522.5589 544.5260 589.3376 614.2175 618.0593 661.6663 696.4421 702.3006 722.1516 753.1008 770.3655 818.9995 828.4132 838.8666 858.5253 882.8004 903.1588 915.5597 933.9366 945.9087 967.5450 981.2149 988.4886 989.4182 992.2983 999.7934 1024.2131 1025.5130 1028.8728 1058.9656 1081.0977 1083.2495 1100.2726 1161.7696 1168.6254 1172.6502 1173.1372 1185.8909 1193.0516 1198.1669 1218.9804 1240.8891 1278.7275 1314.0329 1326.1195 1335.8568 1345.9253 1359.6499 1376.8539 1382.0688 1385.2258 1439.1174 1440.6186 1446.6417 1462.3395 1472.0475 1481.0862 1482.7297 1567.2391 1590.3834 1596.4962 1608.8953 1611.2955 2977.1267 3011.5476 3023.5542 3073.5949 3091.0462 3103.7608 3122.7589 3127.2153 3130.5931 3135.7109 3143.0143 3147.7713 3154.0976 3161.1208 3165.0679 3172.9265 3538.2338
redmass: 5.6969 4.2007 4.5724 4.2291 4.7105 4.2517 5.2338 5.4196 4.1399 5.1046 3.6510 4.5855 3.7390 3.1841 2.6140 2.3354 2.2321 2.8354 1.6403 3.0205 2.7423 4.0112 3.8090 4.0200 3.7166 6.3041 5.9785 4.5881 1.8286 2.9234 1.9649 2.0112 2.1184 3.3906 3.3851 1.2966 1.2471 3.4095 1.5545 1.4966 1.7379 1.7856 1.3845 1.3848 2.5824 5.5430 1.8880 1.3392 2.3322 3.2976 2.3000 2.0835 1.7225 1.6331 2.4241 1.5167 1.2765 1.0535 1.0806 1.1127 1.2759 2.2358 1.6981 2.0831 1.4831 1.3654 1.3284 1.2659 1.2979 1.8136 1.6772 8.7101 3.4698 2.2802 1.7735 1.2369 1.0886 1.1276 2.1384 2.2152 8.9347 5.9085 6.5280 6.0650 6.1806 1.0657 1.0643 1.0649 1.0980 1.0994 1.0939 1.0847 1.0852 1.0883 1.0882 1.0932 1.0935 1.0957 1.0966 1.1012 1.1004 1.0667
irintensity: 1.3250 0.3663 1.5603 0.1550 0.9016 4.5540 5.0680 1.4723 6.7956 2.5476 1.6359 2.2923 7.3257 5.4608 24.7141 40.0577 34.9224 0.5623 86.2165 1.7609 9.6379 1.7882 0.8541 13.0140 32.6355 0.5912 2.3398 4.7403 46.5539 16.0737 67.7015 24.1721 49.2067 9.4972 1.6937 1.0366 1.7769 7.4600 24.7794 6.7574 10.6459 3.5348 0.1530 1.0917 1.2118 0.7910 0.8008 0.5860 2.8727 87.5992 32.9441 38.7442 7.0271 9.3714 28.2542 60.0776 37.1220 0.0731 2.3298 0.3611 5.7670 3.0299 32.1532 22.9236 6.7837 18.7135 55.2165 2.2029 16.1671 71.6005 55.3768 1.3939 64.0959 6.1972 15.2619 6.8196 2.7235 34.7479 74.5001 11.7437 178.8113 0.4152 11.8381 24.2613 16.0976 48.6616 8.2862 26.7296 39.3005 11.8115 26.7770 0.8536 4.1725 6.3668 2.6347 23.3798 27.0133 13.9255 28.7491 23.9249 7.1461 28.1758
temp: 298.150 k
press: 1.00000 atm
elementType: 8 8 7 6 6 6 6 6 6 6 6 6 6 6 6 6 6 6 6 1 1 1 1 1 1 1 1 1 1 1 1 1 1 1 1 1
symmnumber: 1
zpe: 766821.6 jmol-1
zpe.correction: 0.292067 hartree
zpe.thermalcorrener: 0.309339 hartree
zpe.thermalcorrenthalpy: 0.310283 hartree
zpe.thermalcorrgfe: 0.244620 hartree
zpe.sumelectzpe: -823.720287 hartree
zpe.sumelectthermal: -823.703015 hartree
zpe.sumelectthermalent: -823.702071 hartree
zpe.sumelectthermalfe: -823.767733 hartree
dipole: 1.7859 2.0896 -0.5092
dipole: 2.7956
quadrupole: -99.6137 -111.1968 -111.9615
quadrupole: 6.1165 0.9927 12.1824
quadrupole: 7.9770 -3.6061 -4.3708 6.1165 0.9927 12.1824
hfenergy: -824.0123539 hartree
pointgroup: C01 [X(C16H17N1O2)]
dipole: 0.8380368 0.6103012 -0.3672971 debye
polarizability: 232.9706438|-1.7739355|178.4374292|24.9736584|-1.4301879|129.6473268 unknown
InChI: InChI=1S/C16H17NO2/c18-12-11-17(15-9-5-2-6-10-15)16(19)13-14-7-3-1-4-8-14/h1-10,18H,11-13H2
charge 0 multiplicity 1
36 atoms
O  -0.04102 -0.908943 1.758132
O  -0.321886 2.129208 -1.882472
N  1.1281 0.712935 0.559336
C  1.31575 2.085101 0.015784
C  -1.285814 1.119143 1.280106
C  -0.020608 0.242103 1.223999
C  2.257841 -0.194789 0.4071
C  -2.423522 0.536619 0.430361
C  1.093188 2.180892 -1.507832
C  2.082913 -1.441711 -0.239987
C  3.536218 0.170752 0.892436
C  -3.064863 1.338424 -0.549864
C  -2.876389 -0.794461 0.632372
C  3.183183 -2.308394 -0.409836
C  4.636452 -0.697047 0.713392
C  4.465364 -1.938381 0.05968
C  -4.140208 0.822557 -1.311208
C  -3.946508 -1.308176 -0.132475
C  -4.584383 -0.502858 -1.106027
H  2.348824 2.407347 0.23928
H  0.641332 2.791724 0.523943
H  -1.115443 2.164252 0.982685
H  -1.590416 1.116731 2.343621
H  1.682104 1.396338 -2.026611
H  1.436182 3.168602 -1.8609
H  1.087607 -1.73488 -0.586554
H  3.671114 1.115825 1.430703
H  -2.728373 2.368213 -0.716689
H  -2.374061 -1.416852 1.380408
H  3.038642 -3.272887 -0.908744
H  5.621518 -0.407513 1.095566
H  5.318148 -2.612386 -0.075499
H  -4.623959 1.456084 -2.063189
H  -4.2867 -2.336548 0.035082
H  -5.417418 -0.90343 -1.694613
H  -0.707004 1.241706 -1.663687
