program: Gaussian 09
title: 000239802
version: EM64L-G09RevD.01
frameworkgroup: C1[X(C21H18O4)]
method: RPBEPBE
basis: SDD
operation: Freq
keyword: #pfreq=noraman
keyword: PBEPBE/SDD
title: #p freq=noraman PBEPBE/SDD
converged: YES YES NO NO
title: Mulliken charges:
elementType: O O O O C C C C C C C C C C C C C C C C C C C C C H H H H H H H H H H H H H H H H H H
charge: -0.271875 -0.225652 -0.220276 -0.264524 0.188649 -0.255628 0.457720 0.156103 0.073376 -0.524542 0.212341 -0.385219 -0.383855 -0.689394 -0.689580 0.005185 0.190524 0.202443 -0.321866 0.218669 -0.377766 -0.370931 -0.255430 -0.227073 -0.536285 0.224359 0.282453 0.257341 0.285526 0.230300 0.219611 0.224700 0.224694 0.219568 0.230377 0.275787 0.241356 0.237812 0.227340 0.224415 0.213287 0.245142 0.230820
chargesum: 0.00000
title: Mulliken charges with hydrogens summed into heavy atoms:
elementType: O O O O C C C C C C C C C C C C C C C C C C C C C
charge: -0.271875 -0.225652 -0.220276 -0.264524 0.188649 -0.031269 0.457720 0.156103 0.073376 -0.242089 0.212341 -0.127878 -0.098329 -0.014782 -0.014940 0.005185 0.190524 0.202443 -0.046079 0.218669 -0.136411 -0.133119 -0.028090 -0.002658 0.152964
polarizability: 4.01605293e+02 -1.05304313e+00 2.19599638e+02 -1.47917046e+01 -6.51518898e+00 1.52794957e+02
1716.lowfreq: -8.5860 -2.3179 -0.0010 -0.0007 -0.0003 4.7850 25.4041 27.6619 42.8623
frequency: 25.3856 27.4773 42.8297 50.4723 63.0649 88.5443 108.7945 117.6168 122.8642 161.0233 179.6323 188.5302 209.4068 225.7666 231.0906 241.8334 254.2207 274.1831 284.8320 296.8837 309.0399 355.2624 366.2248 404.2867 433.8139 452.1512 457.4477 482.6886 494.8750 510.3959 523.6206 545.3272 565.0623 569.4030 599.1325 617.0592 633.9703 660.8745 673.0072 704.4347 730.0160 743.7260 755.8259 768.0410 788.1797 791.3369 837.3593 843.2063 850.7181 857.9493 865.9153 876.9390 896.5900 918.5939 929.9599 934.5559 956.1182 972.3476 974.3171 987.0963 995.5360 1026.7564 1032.5812 1046.9163 1109.5642 1111.7718 1114.7530 1129.8418 1139.2384 1155.6282 1159.2342 1173.2951 1191.1586 1195.4548 1224.8576 1237.7856 1255.8367 1262.4672 1288.5057 1293.5487 1312.5154 1331.4210 1356.2376 1374.6083 1379.9402 1393.4726 1411.8191 1426.1128 1434.6016 1445.3018 1464.6484 1467.0110 1469.3404 1471.6377 1471.9544 1479.1873 1486.3667 1490.2121 1554.3652 1577.4443 1589.0805 1590.1988 1602.0435 1615.4629 1630.0334 2961.8504 2984.8264 2986.4917 3001.5109 3053.1166 3082.8517 3086.8112 3088.9906 3095.1388 3127.0008 3127.7465 3135.9786 3157.3718 3160.4639 3169.7034 3181.6977 3190.4094 3237.3693
redmass: 4.6351 3.2300 4.0597 4.7134 4.9342 3.8475 4.0181 4.6409 5.9360 3.5761 3.3597 5.5736 1.0506 2.9137 2.3245 1.7348 1.4410 3.6470 4.3732 4.7342 4.2315 5.3967 3.2684 5.3366 3.9418 4.5268 4.7447 5.0443 4.9101 4.9674 6.3705 4.0830 5.0827 4.7239 4.4520 6.3242 5.4693 7.0355 4.7792 4.4771 3.7553 4.4069 1.4204 4.9684 5.4906 3.2780 1.6828 1.5620 1.5034 5.8574 3.9746 1.4214 3.9153 1.1709 5.1886 1.4140 1.4868 1.3242 1.3241 8.1974 4.5004 2.9928 2.1320 2.1736 2.4768 1.2968 1.7246 1.8876 1.5431 1.4201 1.9741 1.0856 2.7610 2.1892 2.7733 2.9409 4.1282 1.9798 1.3383 2.4527 1.5843 1.6593 2.8462 1.1897 10.0066 1.2032 7.3450 1.5400 3.4255 1.6453 1.0445 1.1342 4.8380 1.1249 1.0496 1.0513 2.1567 1.0748 11.3132 7.4262 7.4679 7.3961 6.7511 8.3095 9.2413 1.0333 1.0345 1.0352 1.0841 1.1031 1.1008 1.1001 1.1011 1.1000 1.0951 1.0900 1.0905 1.0937 1.0886 1.0993 1.0972 1.0953 1.0986
irintensity: 1.4078 0.3252 0.0326 2.6805 1.8566 3.8247 0.4490 1.6466 1.1083 0.2117 0.2236 0.4333 0.1297 3.9066 1.5863 0.1100 0.2634 1.9801 2.5410 2.6261 3.4584 0.9548 2.2925 0.0492 1.7558 0.2317 12.8715 6.0456 16.1048 1.1087 2.7413 0.7013 2.3125 1.6853 9.5420 1.2049 7.2958 6.6259 3.6209 1.2467 3.5566 2.6228 81.8540 7.8599 6.4918 44.2061 1.2857 44.7517 1.5678 24.2684 4.5955 16.5473 16.8695 5.9475 1.1886 1.4569 0.0268 0.4462 0.1985 47.8263 48.7308 115.2330 8.7788 17.4130 1.9105 3.0425 22.3132 78.2067 4.4335 14.8055 19.8598 5.4716 73.6428 15.8095 73.7486 56.8321 28.4004 42.7733 0.2054 66.5802 27.8439 128.0331 79.6620 16.3093 7.3060 8.7107 26.6375 24.6313 29.4617 6.7895 5.6980 37.7144 13.4586 34.2271 2.7549 16.2251 38.3385 13.0625 161.2343 53.5114 43.9898 23.7205 37.4573 61.2968 54.7266 76.8467 30.1760 39.7637 12.4615 38.8625 12.5439 75.1239 9.0850 48.1809 15.2666 5.8537 13.8461 24.8742 3.1458 24.9028 4.7132 6.1559 4.3914
temp: 298.150 k
press: 1.00000 atm
elementType: 8 8 8 8 6 6 6 6 6 6 6 6 6 6 6 6 6 6 6 6 6 6 6 6 6 1 1 1 1 1 1 1 1 1 1 1 1 1 1 1 1 1 1
symmnumber: 1
zpe: 877044.5 jmol-1
zpe.correction: 0.334049 hartree
zpe.thermalcorrener: 0.356009 hartree
zpe.thermalcorrenthalpy: 0.356953 hartree
zpe.thermalcorrgfe: 0.282129 hartree
zpe.sumelectzpe: -1110.151205 hartree
zpe.sumelectthermal: -1110.129245 hartree
zpe.sumelectthermalent: -1110.128301 hartree
zpe.sumelectthermalfe: -1110.203124 hartree
dipole: -1.5468 -1.3927 2.4308
dipole: 3.2002
quadrupole: -112.9331 -134.2378 -147.5087
quadrupole: 4.7580 5.5052 4.4453
quadrupole: 18.6267 -2.6779 -15.9488 4.7580 5.5052 4.4453
hfenergy: -1110.4852536 hartree
pointgroup: C01 [X(C21H18O4)]
dipole: -0.5671866 -0.8819406 0.69689 debye
polarizability: 400.7584198|12.9826815|216.1696608|-15.3229467|16.8365957|157.0718071 unknown
InChI: InChI=1S/C21H18O4/c1-12(2)19-10-15-18(25-19)9-8-14-20(22)16(11-24-21(14)15)13-6-4-5-7-17(13)23-3/h4-12H,1-3H3
charge 0 multiplicity 1
43 atoms
O  -4.507864 0.688048 -0.0758
O  -0.339249 -1.511903 0.000082
O  1.782788 2.02533 -0.729232
O  3.43943 0.956723 1.563657
C  -2.436939 -0.327216 -0.047889
C  -6.093029 -1.191588 0.298029
C  -4.676065 -0.71719 0.142213
C  -3.12482 0.908417 -0.190601
C  -1.026135 -0.294001 -0.135613
C  -3.445589 -1.347209 0.163966
C  -0.34307 0.929024 -0.35637
C  -2.496917 2.149695 -0.41338
C  -1.095516 2.137253 -0.494752
C  -6.922611 -0.92769 -0.989082
C  -6.77099 -0.545567 1.538048
C  1.142226 0.959217 -0.461154
C  1.808769 -0.357204 -0.26435
C  3.290495 -0.470302 -0.343877
C  1.05303 -1.485335 -0.059448
C  4.11889 0.26027 0.560175
C  3.911363 -1.277585 -1.325142
C  5.528758 0.212295 0.442459
C  5.319471 -1.351894 -1.434518
C  6.122022 -0.594371 -0.555256
C  4.204848 1.899243 2.381773
H  -6.036983 -2.285746 0.460108
H  -3.27623 -2.410775 0.312751
H  -3.076775 3.069985 -0.517451
H  -0.526298 3.055027 -0.6707
H  -6.986035 0.155761 -1.192833
H  -7.949236 -1.31759 -0.866057
H  -6.467756 -1.417238 -1.868496
H  -6.207772 -0.762472 2.463072
H  -7.797936 -0.936126 1.656054
H  -6.828968 0.550807 1.419592
H  1.464215 -2.485169 0.094718
H  3.276533 -1.823582 -2.032601
H  6.165099 0.784236 1.1242
H  5.778893 -1.976143 -2.2076
H  7.214123 -0.628027 -0.639829
H  4.950481 1.374815 3.011433
H  3.45928 2.390444 3.02382
H  4.70967 2.654133 1.749783
