program: Gaussian 09
title: 000239775
version: EM64L-G09RevD.01
frameworkgroup: C1[X(C2H4N4O2)]
method: RPBEPBE
basis: SDD
operation: Freq
keyword: #pfreq=noraman
keyword: PBEPBE/SDD
title: #p freq=noraman PBEPBE/SDD
converged: NO NO NO NO
title: Mulliken charges:
elementType: O O N N N N C C H H H H
charge: -0.227499 -0.253649 -0.238483 -0.323042 -0.309082 -0.501902 0.285924 0.252214 0.340939 0.341684 0.316446 0.316448
chargesum: 0.00000
title: Mulliken charges with hydrogens summed into heavy atoms:
elementType: O O N N N N C C
charge: -0.227499 -0.253649 -0.238483 0.017898 0.032602 0.130992 0.285924 0.252214
polarizability: 6.99534094e+01 -4.37760413e-01 6.13566163e+01 2.35326972e-03 6.68894083e-04 2.75434712e+01
1716.lowfreq: -435.0024 -9.9081 0.0005 0.0007 0.0009 6.4699 9.8200 122.5397 192.1461
frequency: -435.0022 122.5271 192.1425 229.0563 270.5772 330.6522 336.4642 345.3647 532.3532 595.4184 607.9035 664.0256 706.3148 739.6487 751.3423 1028.4838 1064.8804 1124.2767 1241.9736 1268.3194 1316.1797 1385.7397 1398.3837 1655.5831 1690.5454 1742.0312 3466.1607 3601.7352 3633.0411 3644.9906
redmass: 1.5021 8.1005 1.6363 1.6724 3.2643 1.2647 2.5038 11.8644 1.7736 5.9179 5.0424 9.9051 10.6204 9.1455 5.8588 6.5796 2.4623 4.0731 8.8694 1.1903 1.6341 7.4891 1.7851 1.2861 4.6891 7.0909 1.0415 1.1043 1.0823 1.0841
irintensity: 0.4283 1.2836 0.1282 67.3757 30.4218 369.2667 3.7896 11.6815 143.9596 9.8966 46.1418 1.4986 21.8374 21.3258 4.2582 7.8283 82.6337 27.0712 60.9183 0.3684 0.4091 53.9178 3.9964 89.4971 781.6410 103.7690 4.5036 13.5671 33.2923 142.1318
temp: 298.150 k
press: 1.00000 atm
elementType: 8 8 7 7 7 7 6 6 1 1 1 1
symmnumber: 1
zpe: 213450.4 jmol-1
zpe.correction: 0.081299 hartree
zpe.thermalcorrener: 0.088591 hartree
zpe.thermalcorrenthalpy: 0.089535 hartree
zpe.thermalcorrgfe: 0.049865 hartree
zpe.sumelectzpe: -447.423138 hartree
zpe.sumelectthermal: -447.415846 hartree
zpe.sumelectthermalent: -447.414902 hartree
zpe.sumelectthermalfe: -447.454572 hartree
dipole: -1.0415 -3.4886 0.0004
dipole: 3.6407
quadrupole: -64.2040 -29.2336 -44.2202
quadrupole: -5.8427 0.0055 0.0014
quadrupole: -18.3180 16.6523 1.6657 -5.8427 0.0055 0.0014
hfenergy: -447.5044369 hartree
pointgroup: C01 [X(C2H4N4O2)]
dipole: 0.4664416 1.3542848 0.0001561 debye
dipolederiv: -1.2996244 -0.2242777 -0.0000772 -0.2105779 -0.4985876 -0.0000127 0.0002245 0.0000272 -0.3701743 -1.3016047 0.1990117 0.0001906 0.2251265 -0.5216304 -0.0000801 -0.0000397 0.0000066 -0.3856814 -1.1034856 -0.1141389 -0.0001154 0.0295238 -0.1168625 -0.0000719 0.0000496 -0.0000305 -0.2416165 -0.2379175 0.2485681 0.0001615 -0.2139794 -0.783129 0.0007806 -0.0001871 0.0015623 -0.3920442 -0.2457207 -0.2526399 0.000084 0.2416611 -0.8080827 -0.0007997 -0.000042 -0.0017957 -0.3768002 -0.4998287 -0.155211 -0.0000982 -0.1204611 -0.1752811 -0.0000111 -0.0001594 -0.000001 -0.027364 1.9511954 0.1248531 0.000153 0.2108578 1.1107046 -0.0003395 -0.0000074 -0.0001359 0.3356711 1.8636817 -0.1107001 -0.0002538 -0.2222971 1.0191517 0.0005378 -0.0000091 0.0003129 0.3198607 0.1758238 -0.0440386 -0.0000503 -0.0436699 0.2481542 -0.0002032 0.0000421 -0.0006523 0.430403 0.1656389 0.0391878 -0.0000337 0.0305907 0.2370861 0.0001874 0.0000865 0.0006724 0.4276259 0.2659036 0.1447061 0.119185 0.0365973 0.1442442 0.0325412 0.0555021 0.0303278 0.1400874 0.2659381 0.1446794 -0.1191456 0.0366282 0.1442326 -0.0325287 -0.0554601 -0.0302938 0.1400326 unknown
polarizability: 69.9021928|-0.7932901|61.4078328|-0.002379|-0.0005705|27.5434712 unknown
InChI: InChI=1S/C2H4N4O2/c3-6-1(7)4-5-2(6)8/h4-5H,3H2
charge 0 multiplicity 1
12 atoms
O  -2.361663 -0.250529 -0.000036
O  2.416412 -0.184901 0.000055
N  0.042123 -0.633961 0.00006
N  -0.707057 1.455165 -0.000236
N  0.711951 1.487113 0.000417
N  0.061928 -2.025725 0.000251
C  -1.173047 0.13396 -0.00022
C  1.217599 0.189547 0.000031
H  -1.279509 2.294384 0.000798
H  1.248969 2.349718 -0.000568
H  0.440123 -2.425686 -0.86249
H  0.439773 -2.425483 0.863238
