program: Gaussian 09
title: 000019725
version: EM64L-G09RevD.01
frameworkgroup: C1[X(C15H24)]
method: RPBEPBE
basis: SDD
operation: Freq
keyword: #p
keyword: freq=noraman
keyword: PBEPBE/SDD
title: #p freq=noraman PBEPBE/SDD
converged: NO YES NO NO
title: Mulliken charges:
elementType: C C C C C C C C C C C C C C C H H H H H H H H H H H H H H H H H H H H H H H H
charge: 0.417106 -0.221799 -0.245748 -0.429238 -0.003649 -0.534076 -0.493502 -0.483753 0.497579 -0.827195 -0.070815 -0.445863 -0.854352 -0.733046 -0.736939 0.237432 0.231935 0.229148 0.183790 0.209333 0.199693 0.213975 0.202539 0.208142 0.208288 0.209848 0.241661 0.211302 0.207961 0.214400 0.222917 0.225408 0.223143 0.206061 0.210055 0.222140 0.205167 0.208241 0.232710
chargesum: 0.00000
title: Mulliken charges with hydrogens summed into heavy atoms:
elementType: C C C C C C C C C C C C C C C
charge: 0.417106 0.015633 -0.013813 -0.200090 0.180141 -0.125050 -0.076987 -0.067323 0.497579 -0.164385 0.137146 -0.231463 -0.182884 -0.094790 -0.090821
polarizability: 1.67011216e+02 -2.54403834e+00 1.45465350e+02 4.77140607e+00 -7.46779903e-01 1.42105265e+02
1716.lowfreq: -13.7377 -8.7037 -0.0005 -0.0002 0.0007 13.5479 58.4802 73.3751 121.0451
frequency: 58.1403 73.3335 121.0375 142.7887 188.4993 194.1126 196.1241 205.2346 218.9855 239.4690 256.9980 285.1824 301.1919 307.7720 324.7796 379.6401 391.4250 413.3907 432.8415 438.7238 481.4719 535.8121 556.3561 589.3495 634.2479 664.9534 785.1235 805.5812 820.9568 838.5083 856.5693 885.9645 892.2021 904.5759 915.0855 922.7513 927.9797 948.7726 961.9847 967.3027 982.1956 1013.1369 1028.4830 1035.0646 1043.7268 1055.1273 1069.3010 1096.1002 1112.5250 1120.5052 1136.0324 1152.0291 1166.8011 1175.4370 1178.8351 1197.6229 1211.8983 1213.1032 1222.7701 1239.7038 1259.1347 1270.2707 1277.9783 1294.4419 1310.3975 1318.3575 1328.5663 1329.9730 1334.2320 1341.5257 1359.5349 1375.4223 1383.5739 1390.8084 1391.5875 1457.3651 1458.5949 1462.3709 1467.0281 1468.3469 1469.8525 1472.6302 1479.5821 1482.7940 1485.5049 1492.0584 1679.1135 2919.4451 2944.8605 2948.9881 2953.8441 2956.0289 2964.4092 2967.8459 2971.3710 2971.9548 2983.7838 2995.2019 3012.2250 3023.2219 3024.1719 3037.1425 3042.5265 3045.5129 3055.3273 3062.9594 3072.7998 3075.4020 3078.9760 3080.2182 3111.1768
redmass: 2.5963 2.8964 2.7050 2.9001 1.2089 1.2343 1.2264 1.6712 1.4863 1.3860 2.4570 2.8393 2.3610 2.0086 2.4075 2.2093 2.3757 2.6051 3.3841 2.5507 3.9705 3.4404 3.3186 2.7237 2.8517 3.6360 1.4753 1.7422 2.8005 2.0914 2.7101 2.3454 2.4013 2.0439 1.1739 2.3204 2.1095 1.4701 2.4212 1.5904 1.7017 1.8517 2.1446 1.5911 1.6177 1.3852 1.6363 1.8174 1.5409 1.5353 1.6434 1.9196 1.8046 1.7847 1.8088 1.9025 2.2379 2.0237 1.7270 1.5727 1.4867 1.3616 1.4676 1.3291 1.5332 1.4886 1.4272 1.6563 1.6419 1.8415 1.5918 1.2102 1.2312 1.2073 1.2498 1.0822 1.0480 1.0704 1.0538 1.0584 1.0598 1.0638 1.0667 1.0602 1.0534 1.0506 6.4196 1.0811 1.0599 1.0846 1.0373 1.0580 1.0395 1.0363 1.0419 1.0620 1.0994 1.0871 1.0972 1.0872 1.0964 1.0891 1.0992 1.0980 1.0990 1.0981 1.0981 1.0981 1.0972 1.0977 1.0923
irintensity: 0.0167 0.0858 0.9260 0.2422 0.1672 0.0923 0.1851 0.3601 0.0594 0.0520 0.1531 1.0143 0.3948 1.5083 0.7396 0.1454 0.7492 0.1005 0.5271 0.9161 0.8629 1.3632 1.1778 0.5065 0.1930 0.1337 11.7604 8.4499 0.9006 2.9599 5.5353 0.3827 0.7626 5.0456 2.4660 2.9121 1.6747 1.0243 1.9265 7.5688 1.7419 3.8337 1.4914 6.5065 2.9782 1.3084 5.3518 0.7951 1.9183 4.1880 3.7441 0.9956 13.4774 3.5813 2.0705 2.4035 0.3563 1.5801 3.1759 0.6384 5.0856 4.0661 1.0284 2.2298 1.8940 0.5279 5.5995 2.9241 4.4960 4.6579 2.6731 17.9040 20.4371 25.5334 10.1398 14.0989 13.6884 3.5967 3.9674 2.6582 12.9553 8.3815 3.3121 4.7536 3.5606 17.3051 3.3760 11.9967 57.8028 28.5051 41.9933 29.8087 69.9665 29.5229 35.8653 29.9344 32.8347 68.8773 40.3138 40.3374 22.2390 31.6672 39.1217 56.3827 2.8676 98.2954 29.9510 37.9222 33.2272 44.7811 33.9439
temp: 298.150 k
press: 1.00000 atm
elementType: 6 6 6 6 6 6 6 6 6 6 6 6 6 6 6 1 1 1 1 1 1 1 1 1 1 1 1 1 1 1 1 1 1 1 1 1 1 1 1
symmnumber: 1
zpe: 919067.3 jmol-1
zpe.correction: 0.350054 hartree
zpe.thermalcorrener: 0.365332 hartree
zpe.thermalcorrenthalpy: 0.366276 hartree
zpe.thermalcorrgfe: 0.309520 hartree
zpe.sumelectzpe: -584.778806 hartree
zpe.sumelectthermal: -584.763528 hartree
zpe.sumelectthermalent: -584.762584 hartree
zpe.sumelectthermalfe: -584.819340 hartree
dipole: -0.2393 0.1717 -0.1508
dipole: 0.3309
quadrupole: -95.0691 -94.4280 -91.9769
quadrupole: -0.9838 0.1539 1.0225
quadrupole: -1.2444 -0.6033 1.8478 -0.9838 0.1539 1.0225
hfenergy: -585.1288599 hartree
pointgroup: C01 [X(C15H24)]
dipole: -0.0986682 -0.0622194 0.0577923 debye
polarizability: 167.3848974|1.3707548|145.2517385|-4.3582691|-0.4775593|141.9451953 unknown
InChI: InChI=1S/C15H24/c1-9(2)11-7-8-15(4)12-6-5-10(3)14(15)13(11)12/h5,9,11-14H,6-8H2,1-4H3
charge 0 multiplicity 1
39 atoms
C  0.995213 -1.271698 0.078251
C  -0.248692 0.409382 -0.476351
C  0.743652 -0.505258 -1.286324
C  0.711591 0.143615 0.759836
C  -1.657788 -0.224201 -0.339369
C  -0.196517 -2.239111 0.328711
C  -1.535694 -1.493526 0.551696
C  1.977602 0.307638 -1.743782
C  1.922881 1.064494 0.635056
C  2.330113 -1.98617 0.308355
C  -2.728131 0.776035 0.203265
C  2.514565 1.146957 -0.590071
C  2.3838 1.829211 1.855486
C  -2.981382 1.946838 -0.779489
C  -4.075176 0.072908 0.507708
H  -0.290587 1.461333 -0.805546
H  0.315909 -1.103699 -2.113626
H  0.281574 0.14984 1.776921
H  -1.985388 -0.5314 -1.359322
H  0.019054 -2.874657 1.211159
H  -0.272735 -2.924517 -0.541122
H  -2.388325 -2.177927 0.387872
H  -1.59237 -1.175495 1.612515
H  1.701008 0.96072 -2.598591
H  2.770378 -0.371854 -2.12425
H  2.416726 -2.867825 -0.356896
H  3.194078 -1.327003 0.118906
H  2.404691 -2.350765 1.3514
H  -2.336612 1.19834 1.155341
H  3.382992 1.796513 -0.763549
H  1.572689 2.469917 2.256093
H  3.251674 2.474786 1.632253
H  2.670455 1.138299 2.673829
H  -3.383674 1.565826 -1.738685
H  -3.722732 2.654139 -0.362706
H  -2.063963 2.51971 -1.001635
H  -4.467619 -0.425526 -0.400643
H  -4.831455 0.808544 0.840112
H  -3.979304 -0.690614 1.299191
