program: Gaussian 09
title: 000239757
version: EM64L-G09RevD.01
frameworkgroup: C1[X(C23H29F3N2O2)]
method: RPBEPBE
basis: SDD
operation: Freq
keyword: #p
keyword: freq=noraman
keyword: PBEPBE/SDD
title: #p freq=noraman PBEPBE/SDD
converged: YES YES NO NO
title: Mulliken charges:
elementType: F F F O O N N C C C C C C C C C C C C C C C C C C C C C C C H H H H H H H H H H H H H H H H H H H H H H H H H H H H H
charge: -0.151747 -0.166867 -0.155059 -0.274343 -0.251403 -0.056974 -0.421781 -0.123368 0.393758 -0.155189 -0.089085 0.179684 -0.517178 -0.536954 -0.123538 -0.551636 -0.474412 -0.483935 0.562581 -0.647818 -0.810682 -0.587517 -0.798973 -0.608792 0.171431 0.037777 0.121732 0.272148 0.217340 -0.760449 0.215348 0.236836 0.194510 0.213626 0.215658 0.215984 0.234332 0.270114 0.216531 0.231398 0.222189 0.216187 0.239240 0.220602 0.219397 0.232302 0.221489 0.229977 0.230279 0.246064 0.236644 0.243580 0.219228 0.226301 0.254018 0.350266 0.248264 0.244997 0.245889
chargesum: 0.00000
title: Mulliken charges with hydrogens summed into heavy atoms:
elementType: F F F O O N N C C C C C C C C C C C C C C C C C C C C C C C
charge: -0.151747 -0.166867 -0.155059 -0.274343 -0.251403 -0.056974 -0.071515 0.091979 0.393758 0.081648 0.105425 0.179684 -0.087894 -0.086638 0.146576 -0.103707 -0.036036 -0.024092 0.562581 -0.196119 -0.128937 -0.104808 -0.109864 -0.354774 0.171431 0.037777 0.121732 0.272148 0.217340 -0.021299
polarizability: 3.48353400e+02 -8.32710436e-01 2.62105067e+02 -1.15090174e+01 -3.96168987e+00 1.85536184e+02
1716.lowfreq: -25.7376 -8.5486 -5.8412 -0.0008 -0.0005 0.0003 3.9004 5.6430 24.9296
frequency: -25.6322 2.5693 24.8318 29.0659 35.2182 46.6219 63.8027 68.1516 74.3673 102.7721 129.2173 141.2222 171.5258 177.9629 183.1902 201.8937 211.9630 218.1758 231.5735 242.8656 257.7707 264.0739 271.2808 281.8253 301.1576 301.3674 315.9116 330.0561 338.8131 365.4563 381.0450 384.7409 402.3764 417.6921 427.1876 447.2558 455.6187 486.3476 494.5915 514.1397 535.1591 536.9511 539.3356 559.5229 577.6333 589.6064 602.1426 610.6307 637.3114 646.4361 667.9127 669.3622 693.5780 711.0921 724.1883 762.3592 800.2782 811.8597 818.7063 830.0116 847.0001 856.9982 864.3428 877.2931 900.7334 912.9432 927.3200 938.1160 947.7639 954.0110 962.7774 971.2543 973.3125 993.2388 998.8128 1000.4261 1004.1201 1021.9823 1034.5969 1037.0828 1040.5377 1049.9255 1072.0363 1079.2127 1089.2090 1099.1984 1113.1757 1119.7559 1127.6650 1129.5401 1141.2543 1146.2127 1164.2947 1183.1293 1195.0630 1200.2421 1203.9941 1210.4994 1213.9384 1225.8449 1235.3923 1241.4751 1251.2286 1263.8455 1272.3259 1281.4548 1288.3833 1294.2739 1295.4568 1305.0184 1311.7717 1320.2726 1325.1151 1332.7450 1334.9259 1344.0599 1344.8574 1354.7093 1356.3097 1375.2847 1382.2215 1388.4514 1392.6494 1399.4241 1449.4281 1450.4718 1452.4411 1454.9925 1457.2235 1457.5882 1465.9206 1467.1498 1471.2957 1479.6234 1479.9601 1480.9839 1490.2402 1492.2486 1499.8613 1591.8577 1640.5059 1646.5109 2904.6320 2914.6294 2943.0191 2957.1704 2959.0691 2969.3381 2973.6219 2981.3078 2990.6165 2992.8168 2996.4229 3007.2411 3015.8576 3019.6561 3028.8948 3031.3564 3034.3721 3042.4555 3049.7504 3054.3997 3074.4250 3079.8394 3080.4373 3084.5520 3093.9132 3095.1379 3136.3930 3142.7582 3615.5121
redmass: 1.0830 17.8220 7.0455 4.9992 5.7122 5.6644 4.3559 4.9719 3.2864 2.9637 5.2192 3.4440 2.2978 2.7173 4.8111 1.9800 1.4398 2.9041 2.0693 2.7174 2.9421 2.4416 5.7856 2.5396 3.1471 2.8579 4.0125 4.7877 3.8878 2.6629 3.6786 3.8379 3.0383 4.8498 3.7484 4.5177 4.2663 2.7921 9.0363 4.2558 4.2740 3.0570 3.0445 3.1220 3.6513 1.7973 3.1381 3.3174 9.1484 3.6222 3.2545 3.1835 3.9655 4.1597 2.2426 3.7991 3.4635 2.3522 2.4356 1.8856 1.9811 2.2218 2.6700 1.7721 1.8281 2.1914 2.0853 2.1548 3.5111 2.4143 1.9993 12.4301 3.1189 2.1317 2.3978 5.9575 2.1913 2.1629 1.9029 1.9473 1.6705 2.6968 2.3296 2.9324 2.7560 1.9066 2.8411 2.5044 1.9386 2.0584 2.1888 2.4458 2.4362 1.5004 2.0628 2.8121 2.7577 1.1989 1.5979 3.2476 1.3415 1.5737 1.4005 1.4299 1.4650 1.4545 1.3953 1.5453 2.3523 1.6230 1.6296 1.4220 1.4594 1.3374 1.5811 1.5366 1.4413 1.4098 1.4552 1.4037 1.2535 1.2294 1.2336 1.9238 1.1407 1.9979 1.0654 1.0474 1.3888 1.1438 1.0830 1.0889 1.0758 1.0800 1.0737 1.0554 1.0786 1.0702 5.6247 8.8322 8.2275 9.1827 1.0810 1.0803 1.0665 1.0672 1.0757 1.0671 1.0609 1.0364 1.0568 1.0594 1.0422 1.0367 1.0793 1.0681 1.0924 1.0983 1.1015 1.0970 1.0981 1.1008 1.0991 1.0993 1.1020 1.1000 1.0979 1.0974 1.0918 1.1010 1.0824
irintensity: 1.6069 0.0599 0.5610 0.1469 0.4731 0.8801 1.4976 0.4140 0.5826 1.0963 2.1297 1.2204 0.3612 2.6961 0.2132 1.9967 0.5827 2.0332 0.8576 1.4845 2.3078 0.5800 2.4673 0.8716 5.4685 0.1625 1.5650 1.7900 4.8421 1.2634 3.1575 1.3140 0.7918 0.4724 0.2215 2.2261 1.5008 0.0636 1.7230 0.8622 4.4864 7.3398 1.8497 3.0961 3.2088 53.5950 2.6505 24.1323 4.0651 6.1920 13.3090 9.5193 0.8159 1.5162 0.2628 1.7785 3.4277 0.4779 6.1771 5.1344 2.2021 8.7952 19.8251 10.8515 6.2789 3.5074 36.2403 25.9413 71.4520 86.0426 2.1241 228.7015 18.9375 8.0253 45.1105 320.3183 15.0149 3.9473 17.9910 6.3311 12.3489 20.5130 15.2073 3.2064 23.1113 2.1635 18.6371 4.3719 28.4210 1.4241 8.3020 40.2968 12.7990 4.4074 24.9471 172.2283 171.4118 4.1644 21.5690 2.5275 2.0441 1.4377 1.6998 0.9367 3.7860 2.9761 2.1512 36.6006 115.4711 4.8660 3.0034 0.7385 11.4317 2.2047 58.2274 12.9350 20.4125 1.2671 10.7461 2.7184 52.2773 14.0875 40.9502 44.2649 0.7195 47.8174 24.4622 18.5026 13.9070 9.2401 12.1990 6.1634 9.8896 0.7357 5.4815 9.8602 10.2116 7.1697 8.9251 58.7209 15.4444 166.7290 6.5171 20.9268 22.5878 15.8207 12.3575 45.0422 34.6406 19.1765 16.9404 29.1129 31.6489 3.0463 15.8430 27.5170 51.5617 14.7826 39.9711 54.4728 23.4831 12.9983 32.1394 25.2239 55.8226 22.9933 37.2857 8.6778 12.3772 11.1418 185.4193
temp: 298.150 k
press: 1.00000 atm
elementType: 9 9 9 8 8 7 7 6 6 6 6 6 6 6 6 6 6 6 6 6 6 6 6 6 6 6 6 6 6 6 1 1 1 1 1 1 1 1 1 1 1 1 1 1 1 1 1 1 1 1 1 1 1 1 1 1 1 1 1
symmnumber: 1
zpe: 1267073.7 jmol-1
zpe.correction: 0.482603 hartree
zpe.thermalcorrener: 0.510022 hartree
zpe.thermalcorrenthalpy: 0.510966 hartree
zpe.thermalcorrgfe: 0.422166 hartree
zpe.sumelectzpe: -1451.070329 hartree
zpe.sumelectthermal: -1451.042910 hartree
zpe.sumelectthermalent: -1451.041966 hartree
zpe.sumelectthermalfe: -1451.130766 hartree
dipole: -2.9057 2.8211 1.5781
dipole: 4.3465
quadrupole: -174.7397 -184.7274 -180.4651
quadrupole: 0.2443 -7.4702 -5.4463
quadrupole: 5.2377 -4.7500 -0.4877 0.2443 -7.4702 -5.4463
hfenergy: -1451.5529324 hartree
pointgroup: C01 [X(C23H29F3N2O2)]
dipole: -1.1127391 -1.1130601 -0.6687361 debye
polarizability: 348.0670008|2.3549199|262.3482485|13.0434743|-1.0521675|185.5794013 unknown
InChI: InChI=1S/C23H29F3N2O2/c1-12(29)30-19-7-6-16-14-5-4-13-10-18-15(20(28-27-18)23(24,25)26)11-22(13,3)17(14)8-9-21(16,19)2/h10,14,16-17,19,28H,4-9,11H2,1-3H3
charge 0 multiplicity 1
59 atoms
F  4.140069 3.129001 0.98202
F  6.300642 2.671374 0.39775
F  4.686055 2.871286 -1.192889
O  -5.698916 0.905456 -0.174504
O  -5.287726 2.588973 1.399672
N  5.284552 -1.321988 0.477843
N  5.734772 -0.018013 0.39402
C  -2.68162 -1.249876 0.277445
C  -3.287245 0.067524 -0.30295
C  -1.283673 -1.583689 -0.282245
C  -0.319708 -0.393978 0.033872
C  1.164096 -0.628611 -0.46531
C  -2.349496 1.23435 0.081277
C  -0.904309 0.975881 -0.423587
C  -4.656421 0.030825 0.437096
C  -3.826961 -2.291016 0.140134
C  -0.730242 -2.888994 0.327977
C  -5.131226 -1.446809 0.350565
C  1.654043 -2.038787 -0.036784
C  0.683975 -3.195135 -0.211349
C  -3.514192 0.016809 -1.836306
C  2.051192 0.518324 0.146738
C  1.283554 -0.57404 -2.022982
C  2.95139 -2.283279 0.331422
C  3.508598 0.161224 0.196492
C  3.919369 -1.200374 0.353503
C  4.696564 0.89919 0.228518
C  -5.920585 2.160374 0.407975
C  4.943992 2.35056 0.108755
C  -7.024581 2.888267 -0.330116
H  -2.542724 -1.068697 1.369887
H  -1.360057 -1.720439 -1.382288
H  -0.258035 -0.358732 1.147515
H  -2.344637 1.348628 1.18438
H  -2.718457 2.193222 -0.331506
H  -0.889722 1.039297 -1.528088
H  -0.259764 1.796792 -0.0581
H  -4.518333 0.364324 1.483295
H  -3.739082 -3.105373 0.879945
H  -3.815544 -2.759723 -0.862074
H  -1.404247 -3.735452 0.095373
H  -0.698876 -2.791034 1.432993
H  -5.830496 -1.555146 -0.496968
H  -5.677132 -1.741474 1.263302
H  0.591359 -3.42582 -1.295156
H  1.098964 -4.103236 0.264488
H  -2.563843 -0.077767 -2.388082
H  -4.160922 -0.827003 -2.133462
H  -4.01096 0.944174 -2.172046
H  1.707828 0.716881 1.184202
H  1.889364 1.451941 -0.420274
H  2.331062 -0.748521 -2.328415
H  0.657757 -1.340901 -2.512533
H  0.981565 0.414373 -2.413368
H  3.29013 -3.299515 0.56207
H  6.730873 0.180041 0.467856
H  -7.953908 2.293345 -0.304703
H  -6.749841 3.020783 -1.390984
H  -7.197683 3.869207 0.134988
