program: Gaussian 09
title: 000239750
version: EM64L-G09RevD.01
frameworkgroup: C1[X(C16H20N2O3)]
method: RPBEPBE
basis: SDD
operation: Freq
keyword: #p
keyword: freq=noraman
keyword: PBEPBE/SDD
title: #p freq=noraman PBEPBE/SDD
converged: YES YES NO NO
title: Mulliken charges:
elementType: O O O N N C C C C C C C C C C C C C C C C H H H H H H H H H H H H H H H H H H H H
charge: -0.331475 -0.314728 -0.314715 -0.714555 -0.714666 -0.236029 -0.236000 -0.317451 -0.317555 0.205970 0.205964 0.307442 0.307401 -0.342081 -0.342118 -0.387039 -0.387049 -0.251984 -0.251998 -0.213330 -0.213328 0.219076 0.209069 0.219056 0.209062 0.228695 0.214876 0.228743 0.214891 0.238138 0.238131 0.214992 0.214983 0.223751 0.223740 0.218993 0.218977 0.367937 0.294079 0.368105 0.294030
chargesum: 0.00000
title: Mulliken charges with hydrogens summed into heavy atoms:
elementType: O O O N N C C C C C C C C C C C C C C C C
charge: -0.331475 -0.314728 -0.314715 -0.052539 -0.052531 0.192116 0.192117 0.126121 0.126080 0.205970 0.205964 0.307442 0.307401 -0.103943 -0.103987 -0.172046 -0.172066 -0.028233 -0.028257 0.005663 0.005649
polarizability: 2.77910876e+02 2.08382949e-02 2.12075491e+02 -2.04257283e+01 -5.98782172e-03 1.16624993e+02
1716.lowfreq: -6.9024 -0.0007 0.0003 0.0005 4.4541 4.9269 17.7990 25.4870 34.5039
frequency: 17.2797 25.4848 34.5037 46.5469 59.5621 88.9984 98.0187 114.6425 117.5161 189.0078 200.5417 212.7040 230.4475 267.7355 274.8510 293.4161 300.1300 323.4790 333.6980 342.8400 417.2071 419.5358 458.9551 459.7265 469.0008 472.7263 485.4372 539.3955 542.7611 560.3988 561.7077 601.0955 604.2562 637.5844 712.3026 714.0785 717.3491 737.3892 738.3238 751.0264 751.2251 783.8088 816.8579 817.8004 838.4109 838.9559 883.0178 884.4894 905.5059 922.2437 922.5895 958.4400 958.4616 1002.5863 1007.8682 1011.8599 1015.9674 1031.9294 1037.9106 1039.1314 1048.2009 1103.9394 1108.1904 1121.3866 1122.4950 1165.4531 1166.2786 1167.3706 1172.8584 1201.6912 1202.3899 1245.3707 1247.2715 1266.8881 1267.3680 1323.9287 1325.6730 1339.3300 1358.7584 1362.9510 1390.0554 1390.4883 1404.2006 1448.4991 1449.4829 1452.7599 1463.8787 1464.6585 1466.8611 1499.8743 1501.4909 1580.6672 1581.0838 1615.6612 1617.3106 1642.0887 1656.0013 2955.5120 2960.8888 2977.0499 2977.9989 3019.6518 3023.0608 3043.1356 3043.5796 3115.2346 3115.3342 3135.2568 3135.2843 3145.6973 3145.7431 3167.7723 3167.8329 3443.5840 3456.0296 3656.1424 3658.3008
redmass: 4.3425 5.2565 4.7160 5.0778 5.5893 5.4966 5.7762 3.2263 4.4383 3.4998 4.0099 4.4017 2.8353 2.5249 2.7102 4.2072 4.5823 1.6302 3.5211 2.0092 4.2094 3.5533 3.0619 2.7438 3.1307 1.1349 2.9394 4.2346 4.3675 4.5894 4.9175 4.5380 4.5088 1.1047 3.4948 4.0653 1.1192 2.7649 2.4848 1.5924 1.4431 2.3453 3.7789 3.8080 1.5597 1.5408 3.8527 4.0715 2.4365 1.3764 1.3876 1.2947 1.2948 2.4245 2.0046 1.9185 2.4841 2.6558 1.7864 1.7419 2.8817 2.3585 1.8491 1.5927 1.5514 1.4106 1.0675 1.4661 2.5468 1.2566 1.1961 1.1823 1.1752 1.5713 1.5539 2.0409 2.0270 1.2368 1.2995 1.3834 6.7776 6.7015 1.4943 2.3649 2.4329 1.0973 1.1281 1.1384 1.0827 3.5349 3.4422 6.4690 6.4913 3.3796 4.4773 1.2469 1.4178 1.0559 1.0560 1.0593 1.0592 1.1052 1.1068 1.1057 1.1056 1.0867 1.0867 1.0884 1.0884 1.0935 1.0935 1.1002 1.1002 1.0567 1.0546 1.0946 1.0956
irintensity: 0.7829 0.5795 0.0033 8.5518 0.2585 8.6390 0.2709 5.7058 0.4060 0.7593 2.5048 0.4121 5.2216 1.4582 0.5335 3.5684 8.4282 208.5007 3.8138 152.0916 1.0995 8.4635 1.3101 15.9387 10.6951 4.9040 3.3792 16.3281 0.3858 2.0266 0.0859 12.2341 0.0813 288.3395 1.2949 0.0760 0.0084 0.0881 63.0359 121.8187 8.9871 12.5779 0.2751 43.2052 1.9649 0.1054 22.6730 27.7326 42.3159 0.1231 11.0917 0.0286 0.0290 0.0001 1.8309 1.7939 53.2216 44.5961 32.5071 0.7973 66.0887 27.4726 42.7557 19.6159 35.8389 88.1627 0.7354 60.7264 84.6391 2.1419 19.2931 6.2620 9.4337 0.4123 10.5738 105.3866 10.1535 6.5670 1.9875 10.7802 2.9935 36.4298 3.2974 6.7506 4.8327 10.3308 1.7461 18.3228 9.1568 317.2386 41.7725 1.0490 0.2627 0.1222 69.9130 438.2124 1.7751 8.7421 55.8921 84.4319 37.5076 83.1626 0.9309 28.0147 48.5710 23.4118 2.3174 6.8654 6.2086 4.9573 55.1101 42.1852 3.6548 416.0187 185.7793 7.6859 75.8637
temp: 298.150 k
press: 1.00000 atm
elementType: 8 8 8 7 7 6 6 6 6 6 6 6 6 6 6 6 6 6 6 6 6 1 1 1 1 1 1 1 1 1 1 1 1 1 1 1 1 1 1 1 1
symmnumber: 1
zpe: 878577.4 jmol-1
zpe.correction: 0.334632 hartree
zpe.thermalcorrener: 0.354904 hartree
zpe.thermalcorrenthalpy: 0.355848 hartree
zpe.thermalcorrgfe: 0.283821 hartree
zpe.sumelectzpe: -955.281787 hartree
zpe.sumelectthermal: -955.261515 hartree
zpe.sumelectthermalent: -955.260571 hartree
zpe.sumelectthermalfe: -955.332599 hartree
dipole: 0.0042 1.1820 0.0015
dipole: 1.1820
quadrupole: -137.6202 -107.1462 -125.3082
quadrupole: -0.0116 -11.4962 -0.0062
quadrupole: -14.2621 16.2120 -1.9500 -0.0116 -11.4962 -0.0062
hfenergy: -955.6164196 hartree
pointgroup: C01 [X(C16H20N2O3)]
dipole: 0.0017589 0.4650334 0.0007872 debye
polarizability: 278.211457|0.0150166|212.0754693|-19.2000341|0.0388843|116.3244332 unknown
InChI: InChI=1S/C16H20N2O3/c17-13-5-1-3-7-15(13)20-11-9-19-10-12-21-16-8-4-2-6-14(16)18/h1-8H,9-12,17-18H2
charge 0 multiplicity 1
41 atoms
O  -0.000866 1.865893 0.000961
O  2.961561 1.560896 0.023613
O  -2.962966 1.562396 -0.021909
N  1.492365 -0.709802 0.748044
N  -1.491677 -0.706315 -0.747161
C  0.965496 2.685567 -0.756578
C  -0.966624 2.685861 0.758968
C  2.127503 1.79871 -1.178447
C  -2.129141 1.799523 1.180429
C  3.615669 0.293372 0.077755
C  -3.616156 0.294475 -0.07728
C  2.851364 -0.847415 0.483683
C  -2.850724 -0.845333 -0.48374
C  4.99306 0.1990 -0.182679
C  -4.993587 0.198789 0.182468
C  3.532801 -2.093691 0.593415
C  -3.53108 -2.092074 -0.594861
C  5.657718 -1.045038 -0.061051
C  -5.657167 -1.045691 0.059492
C  4.914547 -2.186441 0.323057
C  -4.912882 -2.186167 -0.325239
H  1.34956 3.504663 -0.114812
H  0.46002 3.122052 -1.643488
H  -1.350186 3.505512 0.117614
H  -0.460838 3.121576 1.646081
H  1.76159 0.842167 -1.599742
H  2.737068 2.316771 -1.945772
H  -1.763706 0.842678 1.601453
H  -2.738617 2.317592 1.947824
H  5.534764 1.107989 -0.466513
H  -5.536153 1.107112 0.466783
H  2.97298 -2.984484 0.905242
H  -2.970371 -2.982155 -0.907128
H  6.731582 -1.118939 -0.259502
H  -6.731063 -1.120636 0.257375
H  5.415129 -3.156693 0.420678
H  -5.412621 -3.156748 -0.423898
H  1.0478 0.213205 0.728342
H  0.948309 -1.502204 1.077363
H  -1.047961 0.217058 -0.726299
H  -0.946701 -1.497932 -1.076839
