program: Gaussian 09
title: 000239749
version: EM64L-G09RevD.01
frameworkgroup: C1[X(C16H15NO5)]
method: RPBEPBE
basis: SDD
operation: Freq
keyword: #p
keyword: freq=noraman
keyword: PBEPBE/SDD
title: #p freq=noraman PBEPBE/SDD
converged: YES YES NO NO
title: Mulliken charges:
elementType: O O O O O N C C C C C C C C C C C C C C C C H H H H H H H H H H H H H H H
charge: -0.323614 -0.297918 -0.248346 -0.172445 -0.188144 -0.442157 0.429662 0.241199 -0.104060 0.357015 0.226957 -0.526797 -0.376861 -0.392612 -0.254623 -0.236363 0.226253 0.231653 0.246204 -0.783177 -0.740900 -0.744877 0.338818 0.239278 0.267305 0.229134 0.231371 0.323910 0.261104 0.213425 0.259840 0.244900 0.254865 0.256359 0.249017 0.249515 0.255107
chargesum: 0.00000
title: Mulliken charges with hydrogens summed into heavy atoms:
elementType: O O O O O N C C C C C C C C C C C C C C C C
charge: -0.323614 -0.297918 -0.248346 -0.172445 -0.188144 -0.118247 0.429662 0.241199 -0.104060 0.357015 0.226957 -0.187979 -0.137583 -0.125307 -0.025489 -0.004992 0.226253 0.231653 0.246204 -0.048808 0.015224 0.008762
polarizability: 2.50782217e+02 -7.78868189e+00 2.82167226e+02 6.60629309e-02 4.92329899e+00 1.11702356e+02
1716.lowfreq: -6.8191 -2.9538 -0.0007 -0.0007 -0.0004 4.5115 26.3189 33.6984 36.8714
frequency: 26.2640 33.6889 36.8530 43.2059 50.7132 52.3389 63.9727 67.4789 72.0683 78.6978 91.1797 131.3959 153.2381 157.8192 212.3775 231.6992 259.3478 270.9552 282.0035 295.9298 326.8034 355.2670 400.6028 431.4615 472.8770 483.9124 517.5057 522.2412 538.7817 549.7778 554.9326 584.1490 586.5961 611.9366 630.2125 665.4192 676.9424 702.7868 713.8688 731.5646 773.7397 783.3168 809.5738 814.2026 844.5857 882.5445 903.9202 933.7970 963.7253 974.8299 983.4837 985.2573 992.8154 1006.0506 1029.0345 1036.8951 1039.3701 1040.2085 1046.3876 1079.9768 1138.5813 1157.8775 1163.8722 1175.6407 1195.4885 1229.1236 1263.6901 1323.6585 1360.6172 1383.2145 1385.4829 1388.4817 1397.0668 1404.1922 1436.8482 1446.1504 1449.4183 1451.2808 1452.0447 1453.2752 1453.5821 1468.5624 1494.7598 1521.9452 1585.1334 1609.9165 1624.7075 1640.3533 1687.8485 1693.0085 2995.5612 3007.1825 3009.2474 3092.3400 3096.0995 3097.4487 3105.7602 3133.5207 3143.6765 3145.4787 3148.9550 3163.9497 3175.2562 3201.0993 3525.6842
redmass: 4.9223 2.5229 2.1055 1.4755 2.6182 2.6846 2.4962 4.5009 2.0202 1.7118 4.2470 4.6634 4.6612 5.3660 7.2921 6.5386 4.4875 5.9195 4.6824 4.5198 6.7292 3.6620 5.5196 3.6121 4.7113 4.5866 4.5611 3.5731 4.0074 3.3482 4.2154 3.7482 4.9577 5.0217 4.5113 3.4584 4.7176 3.3249 2.1257 2.9013 1.5660 4.9754 2.9584 4.4559 6.1585 1.8320 4.5407 1.6130 1.3729 3.0401 2.1151 2.1387 1.3372 2.6163 3.0109 1.6687 1.6574 1.6531 3.2578 4.8555 2.2750 2.4123 2.0956 1.1705 1.5434 2.4748 1.7495 2.9809 2.8196 1.2481 1.2458 1.2358 6.5243 2.8707 6.2758 1.7615 1.1780 1.0553 1.0578 1.0650 1.0804 1.0964 3.1455 3.7765 7.0862 5.8401 5.7442 7.2556 10.3991 10.5152 1.0364 1.0380 1.0368 1.0993 1.0955 1.0972 1.0991 1.0855 1.1017 1.1012 1.0894 1.0955 1.0991 1.0937 1.0758
irintensity: 1.0747 2.4069 1.6790 2.5573 2.3805 1.4098 6.4192 0.3676 1.4849 1.8695 1.0717 3.8350 1.0521 3.7613 0.1363 3.2831 3.6335 1.1893 1.3535 4.4848 2.8961 0.4542 3.3654 3.9017 14.8369 3.5106 13.5941 0.9051 0.9863 10.1592 6.5160 2.4439 21.8346 5.9165 4.4557 10.4572 5.1947 18.1347 52.7659 2.5010 88.4576 31.5914 8.2066 10.7799 95.6414 4.7660 28.9060 27.0314 0.1471 15.1784 36.0951 177.3693 1.3650 46.0786 120.6859 3.3869 12.0520 16.1440 108.2817 19.2689 504.1469 99.2005 254.8722 17.4866 2.7970 82.5068 41.5889 66.6198 196.4309 51.6026 44.0410 85.9473 10.4211 119.7654 29.5953 35.1530 2.4211 30.1360 27.1944 7.2465 40.9827 19.4291 366.3789 18.1050 30.0391 109.9902 156.3869 53.2948 122.1681 212.4292 11.4298 1.3592 1.4244 14.1427 6.7270 5.9571 11.2449 2.0018 7.6252 10.2509 11.4122 23.6020 21.7607 26.5615 29.3296
temp: 298.150 k
press: 1.00000 atm
elementType: 8 8 8 8 8 7 6 6 6 6 6 6 6 6 6 6 6 6 6 6 6 6 1 1 1 1 1 1 1 1 1 1 1 1 1 1 1
symmnumber: 1
zpe: 730138.7 jmol-1
zpe.correction: 0.278095 hartree
zpe.thermalcorrener: 0.300008 hartree
zpe.thermalcorrenthalpy: 0.300952 hartree
zpe.thermalcorrgfe: 0.223591 hartree
zpe.sumelectzpe: -1048.032749 hartree
zpe.sumelectthermal: -1048.010836 hartree
zpe.sumelectthermalent: -1048.009892 hartree
zpe.sumelectthermalfe: -1048.087253 hartree
dipole: -3.2669 -1.9808 -2.6093
dipole: 4.6265
quadrupole: -86.7968 -122.8717 -140.4551
quadrupole: -10.6861 0.5788 0.0067
quadrupole: 29.9111 -6.1638 -23.7473 -10.6861 0.5788 0.0067
hfenergy: -1048.3108441 hartree
pointgroup: C01 [X(C16H15N1O5)]
dipole: -0.8741751 -1.2039581 -1.0485603 debye
polarizability: 261.321271|-16.6996639|271.3961799|-2.3412386|7.569087|111.9343487 unknown
InChI: InChI=1S/C16H15NO5/c1-9(18)17-14-8-15(21-10(2)19)12-6-4-5-7-13(12)16(14)22-11(3)20/h4-8,17H,1-3H3
charge 0 multiplicity 1
37 atoms
O  -2.235373 -1.37469 -0.341202
O  2.740803 1.312864 -0.223162
O  -1.580664 3.600717 -0.245023
O  -2.127768 -2.162149 1.877432
O  2.318591 2.665802 1.660902
N  -2.208459 1.335706 -0.23827
C  0.251926 -1.490129 -0.296826
C  1.514286 -0.780823 -0.256814
C  -0.953442 -0.728024 -0.2540
C  -0.954551 0.678378 -0.223796
C  1.476055 0.651639 -0.191057
C  0.29289 1.380775 -0.18741
C  0.268574 -2.920606 -0.391413
C  2.738423 -1.521198 -0.289172
C  1.477328 -3.617005 -0.425553
C  2.722427 -2.915143 -0.367637
C  -2.477398 2.708438 -0.244315
C  -2.725526 -2.109977 0.792994
C  3.061114 2.335645 0.722809
C  -3.96329 3.058965 -0.237158
C  -4.024453 -2.785217 0.418585
C  4.416474 2.906575 0.376819
H  0.280455 2.470246 -0.149741
H  -0.678448 -3.465387 -0.448091
H  3.682096 -0.969776 -0.259987
H  1.475528 -4.709908 -0.498289
H  3.662834 -3.475747 -0.3914
H  -3.009988 0.701613 -0.283668
H  -4.210716 3.54896 0.721155
H  -4.630011 2.189419 -0.371069
H  -4.161194 3.790087 -1.038618
H  -4.679093 -2.099436 -0.143731
H  -4.531979 -3.141888 1.326404
H  -3.81546 -3.648576 -0.239013
H  5.166907 2.100791 0.308398
H  4.716203 3.637846 1.140756
H  4.372899 3.398213 -0.61094
