program: Gaussian 09
title: 000019697
version: EM64L-G09RevD.01
frameworkgroup: C1[X(C9H7ClN4)]
method: RPBEPBE
basis: SDD
operation: Freq
keyword: #p
keyword: freq=noraman
keyword: PBEPBE/SDD
title: #p freq=noraman PBEPBE/SDD
converged: NO YES NO NO
title: Mulliken charges:
elementType: Cl N N N N C C C C C C C C C H H H H H H H
charge: -0.003225 -0.099253 0.008382 0.015798 -0.571709 0.291446 0.048287 -0.346000 -0.338508 -0.227774 -0.229014 -0.222850 0.032540 -0.299672 0.271960 0.283893 0.230656 0.232929 0.232436 0.347373 0.342307
chargesum: 0.00000
title: Mulliken charges with hydrogens summed into heavy atoms:
elementType: Cl N N N N C C C C C C C C C
charge: -0.003225 -0.099253 0.008382 0.015798 0.117970 0.291446 0.048287 -0.074041 -0.054614 0.002882 0.003915 0.009586 0.032540 -0.299672
polarizability: 2.18405837e+02 5.92870311e+00 1.59618317e+02 6.87816350e-03 -4.32795084e-02 5.13039778e+01
1716.lowfreq: -9.6150 -5.4263 -0.0020 -0.0017 -0.0015 3.7986 44.5696 80.2961 108.5116
frequency: 44.5666 80.2960 108.5070 151.6081 182.4947 222.9409 227.9003 315.5453 323.2211 404.8994 410.2112 455.4329 529.2269 536.0317 562.3363 564.1517 614.9132 648.1053 649.9438 689.6134 705.1301 779.3519 802.9848 824.3208 866.8670 890.0084 945.3866 960.3922 989.8984 1001.1839 1005.6546 1012.2680 1025.7820 1076.6462 1113.3310 1173.4288 1181.4717 1221.2026 1245.4260 1312.9356 1368.5283 1389.8977 1414.8452 1447.2191 1461.2898 1491.8205 1522.6915 1588.0426 1610.3433 1620.9982 3129.8259 3143.2799 3157.2616 3169.8902 3176.1528 3549.3130 3707.3431
redmass: 4.1721 6.1782 6.5481 10.7761 7.7788 5.5014 5.9804 4.9979 7.2474 2.8576 8.2779 3.6213 4.9839 1.2090 1.0638 8.4190 6.4890 7.7213 7.3048 5.1710 1.7930 2.7381 8.1050 4.7735 1.2446 12.3754 8.5135 1.4283 6.1507 1.3749 2.5209 1.3328 1.9811 1.6344 3.3623 1.0583 1.1365 7.1749 5.0445 1.3751 5.1647 7.9571 4.4174 2.8452 4.1345 3.4446 2.7505 6.3600 3.7757 2.1745 1.0856 1.0895 1.0943 1.0950 1.0993 1.0446 1.1059
irintensity: 0.4478 2.1178 1.0198 0.5804 4.2908 0.4133 0.5959 13.0372 0.0167 0.0186 3.7642 0.6218 3.2999 281.5398 20.0635 10.7137 0.6246 5.4144 29.0821 14.5660 49.9702 73.7275 72.0218 0.0560 0.0049 0.1366 44.6655 4.8706 1.0592 0.0008 10.4084 0.6945 7.9141 4.9141 45.3983 0.3598 29.7822 28.3661 222.2770 9.0558 194.3822 41.5818 172.3253 175.5099 402.6290 239.4844 377.2871 0.8328 153.0651 374.3687 0.1556 14.7056 21.1691 8.7348 19.2634 146.1921 55.1984
temp: 298.150 k
press: 1.00000 atm
elementType: 17 7 7 7 7 6 6 6 6 6 6 6 6 6 1 1 1 1 1 1 1
symmnumber: 1
zpe: 393597.5 jmol-1
zpe.correction: 0.149913 hartree
zpe.thermalcorrener: 0.161228 hartree
zpe.thermalcorrenthalpy: 0.162172 hartree
zpe.thermalcorrgfe: 0.111531 hartree
zpe.sumelectzpe: -1025.267154 hartree
zpe.sumelectthermal: -1025.255839 hartree
zpe.sumelectthermalent: -1025.254895 hartree
zpe.sumelectthermalfe: -1025.305536 hartree
dipole: -1.8514 3.9083 -0.0007
dipole: 4.3246
quadrupole: -78.9790 -72.2672 -91.0895
quadrupole: 12.1566 0.0024 -0.0234
quadrupole: 1.7995 8.5114 -10.3109 12.1566 0.0024 -0.0234
hfenergy: -1025.417067 hartree
pointgroup: C01 [X(C9H7Cl1N4)]
dipole: -0.5217436 1.6067527 0.2025126 debye
dipolederiv: -0.445274 0.3959889 0.0572587 0.5098712 -0.7386026 -0.0915852 0.0703042 -0.0879903 -0.1016222 -1.5224067 -0.5645833 -0.0243489 -0.4224579 -0.8039324 -0.0584777 -0.0090561 -0.0537271 -0.1990545 -1.8411792 0.5003031 0.1117652 0.4811818 -0.7842173 -0.0928709 0.1097107 -0.0931426 -0.1303987 -0.737011 -0.0233372 0.0144299 -0.1883182 -1.460802 -0.1444155 -0.0040398 -0.1504455 -0.1885068 -0.6630839 -0.5800511 -0.0685811 -0.7545898 -1.1965388 -0.0363457 -0.0877407 -0.040346 -0.690836 -0.775866 -0.0267648 0.0197592 0.0097476 -0.0406022 -0.0009078 0.0240544 0.0000183 -0.0360256 2.1431431 0.0666696 -0.0549667 -0.0679673 0.8898053 0.093788 -0.0704501 0.088927 0.1189091 0.1408107 0.1133046 0.0049997 -0.2009279 -0.0114141 0.0182899 -0.0315084 0.0087913 -0.1149166 0.1202892 -0.1048251 -0.0191212 0.1971106 -0.0100657 0.0053624 0.0158246 0.0148328 -0.1083289 -0.1844327 -0.1737543 -0.019071 -0.2649825 0.048149 0.0317814 -0.0293234 0.0289184 -0.154962 -0.1741451 0.1686183 0.0197981 0.2463418 0.0748899 0.0189573 0.0285867 0.0213304 -0.1555119 0.1170892 0.0033076 -0.0075115 0.0230646 0.0333541 0.018707 -0.0051976 0.0192981 -0.1338282 1.4075078 0.6398504 0.0382594 0.792297 1.7172477 0.1473843 0.0554253 0.1513431 0.2564632 1.837522 -0.5037971 -0.1135546 -0.4886675 1.7665946 0.213179 -0.1121824 0.2137191 0.0989208 0.1264348 -0.0745255 -0.0077272 -0.0581557 0.0035413 -0.0151834 -0.005817 -0.0147872 0.1502824 0.1345217 0.0690978 0.0084916 0.0631089 0.0289801 -0.0162098 0.0078154 -0.0164511 0.1511323 0.0022863 0.0837643 0.0143829 0.1142906 -0.0585006 -0.0283066 0.017881 -0.0273196 0.1548553 0.0144703 -0.0779071 -0.0044439 -0.1096803 -0.0645681 -0.0221441 -0.0080922 -0.0231527 0.1561279 -0.1386972 -0.0065122 0.0084458 -0.00578 0.0958829 -0.0069079 0.0084751 -0.006869 0.1568304 0.2785098 0.092328 0.0142416 0.048792 0.2146375 -0.0214754 0.0092487 -0.0227838 0.3857425 0.1595111 0.0028252 0.0074936 0.0757209 0.2961616 -0.0126196 0.0160817 -0.0101633 0.3847277 unknown
polarizability: 218.7816716|-1.2560289|157.6483563|-5.3285804|12.3479085|52.8981044 unknown
InChI: InChI=1S/C9H7ClN4/c10-8-12-7(13-9(11)14-8)6-4-2-1-3-5-6/h1-5H,11H2
charge 0 multiplicity 1
21 atoms
Cl 3.207114 -2.589445 -0.477014
N  0.898181 1.258084 0.043618
N  0.940431 -1.1504 -0.238308
N  3.027966 0.074442 -0.160336
N  2.947462 2.40099 0.112423
C  -1.209877 0.01096 -0.037151
C  0.268064 0.051316 -0.077663
C  -1.955786 1.209927 0.123153
C  -1.890166 -1.230779 -0.158495
C  -3.36372 1.165293 0.16152
C  -3.298505 -1.26986 -0.119137
C  -4.038925 -0.07377 0.04078
C  2.269753 1.222421 -0.001615
C  2.281466 -1.039484 -0.267512
H  -1.414164 2.155903 0.215069
H  -1.297304 -2.141862 -0.281587
H  -3.93618 2.091037 0.284842
H  -3.819999 -2.228475 -0.212712
H  -5.133903 -0.106486 0.07096
H  3.964444 2.392666 0.079299
H  2.425747 3.266423 0.228366
