program: Gaussian 09
title: 000239742
version: EM64L-G09RevD.01
frameworkgroup: C1[X(C11H15N5O)]
method: RPBEPBE
basis: SDD
operation: Freq
keyword: #p
keyword: freq=noraman
keyword: PBEPBE/SDD
title: #p freq=noraman PBEPBE/SDD
converged: YES YES NO NO
title: Mulliken charges:
elementType: O N N N N N C C C C C C C C C C C H H H H H H H H H H H H H H H
charge: -0.268715 -0.209234 -0.103426 -0.058874 -0.134182 -0.114780 -0.041951 -0.470256 -0.469618 -0.300549 0.137567 -0.077101 -0.226495 0.248253 -0.389203 -0.646843 -0.628140 0.275749 0.227200 0.301458 0.239939 0.242082 0.223549 0.221970 0.290696 0.239691 0.317486 0.218402 0.219745 0.219588 0.219484 0.296508
chargesum: 0.00000
title: Mulliken charges with hydrogens summed into heavy atoms:
elementType: O N N N N N C C C C C C C C C C C
charge: -0.268715 -0.209234 -0.103426 -0.058874 -0.134182 -0.114780 0.233799 0.058402 0.012404 0.144970 0.137567 -0.077101 0.064201 0.248253 -0.149512 0.108789 0.107440
polarizability: 2.25567739e+02 -3.81729347e+00 1.56078694e+02 8.67674761e+00 -2.67227559e+00 9.51768300e+01
1716.lowfreq: -10.6705 0.0004 0.0005 0.0009 5.0134 10.9321 29.9283 46.1923 73.7710
frequency: 29.8633 46.0612 73.7366 84.1893 113.5545 125.2324 138.7266 150.3726 184.6675 230.8296 234.4161 275.3001 291.1620 308.0965 354.5977 375.7988 406.4977 494.2807 549.7142 578.0161 590.7391 614.1717 640.1397 658.0292 673.5593 686.8501 766.3641 788.0153 829.5352 833.4897 841.7111 867.8127 891.6158 902.2731 917.6489 928.3262 935.0282 1002.8885 1027.6742 1049.6363 1063.6339 1086.9411 1098.0255 1098.7678 1129.3825 1148.5023 1160.5569 1165.5875 1183.0823 1197.1998 1221.1926 1240.1146 1256.6144 1282.1929 1289.1653 1310.0307 1315.8728 1328.2937 1338.1873 1345.5908 1363.9480 1388.1100 1405.0017 1424.1927 1444.7356 1458.4995 1470.3457 1473.5011 1477.3478 1484.8170 1491.6973 1497.8255 1504.2121 1521.2710 1596.9318 2953.1788 2964.3168 3010.3291 3024.7465 3027.1801 3027.7032 3035.8726 3058.9730 3071.3914 3095.7875 3096.8272 3110.3204 3125.4083 3154.1443 3259.4115
redmass: 3.6350 3.9559 2.5402 2.9236 2.5473 1.0706 2.0223 2.6358 3.8711 3.4809 2.8153 4.4640 5.8408 4.6499 3.6894 3.2594 3.5662 4.2443 3.8141 3.6372 4.4278 3.3702 5.4646 10.0802 5.6540 6.6588 4.2448 8.1854 2.7503 6.0025 1.4973 2.6438 1.8432 3.3428 2.7233 1.4283 2.5326 3.2552 3.7085 1.9017 1.4479 2.7291 1.2326 2.8792 1.7759 1.3661 1.4991 1.7282 1.8379 2.4658 1.3765 3.5404 1.6574 2.8293 3.8406 1.4776 1.2609 1.6280 2.8313 1.9166 3.2334 1.7487 1.2396 2.6271 1.4709 1.5263 1.0865 1.1588 1.1021 1.0463 1.0957 1.0482 1.7527 7.7295 4.8766 1.0351 1.0364 1.0573 1.0649 1.1004 1.0628 1.1013 1.0884 1.1072 1.1017 1.1042 1.1046 1.0968 1.0917 1.0982
irintensity: 1.9704 3.2476 0.2220 2.3566 2.2207 0.1961 4.4416 4.5915 0.4629 1.6073 4.7316 1.4428 3.8647 1.0687 0.6429 10.1237 8.3506 0.0785 3.0462 5.2989 1.5092 4.5065 20.8768 7.2090 20.5297 2.4126 30.6451 10.9898 6.3893 4.3718 19.0354 5.2893 8.1399 5.4480 12.9729 10.3146 47.4194 78.0748 127.3632 20.0282 7.8856 10.8527 0.3760 7.3602 14.7635 0.0595 66.9291 12.5178 25.3045 118.4971 80.0537 15.1110 4.5294 21.8722 85.2545 29.1199 1.3870 35.3862 44.2714 58.0152 35.0164 10.1778 25.3549 34.3752 0.0278 4.5302 13.2390 27.5264 30.7870 3.7218 8.2719 31.7721 64.9919 61.8360 579.2120 79.8965 182.3852 68.0052 24.3841 40.2339 28.8688 32.7575 25.9774 13.0059 10.9183 42.1454 15.2746 1.1137 23.7665 3.5831
temp: 298.150 k
press: 1.00000 atm
elementType: 8 7 7 7 7 7 6 6 6 6 6 6 6 6 6 6 6 1 1 1 1 1 1 1 1 1 1 1 1 1 1 1
symmnumber: 1
zpe: 680481.3 jmol-1
zpe.correction: 0.259182 hartree
zpe.thermalcorrener: 0.274522 hartree
zpe.thermalcorrenthalpy: 0.275466 hartree
zpe.thermalcorrgfe: 0.215583 hartree
zpe.sumelectzpe: -775.879221 hartree
zpe.sumelectthermal: -775.863880 hartree
zpe.sumelectthermalent: -775.862936 hartree
zpe.sumelectthermalfe: -775.922820 hartree
dipole: -1.1099 -0.6356 1.6152
dipole: 2.0603
quadrupole: -80.2217 -104.6731 -99.8627
quadrupole: -6.5893 -4.0360 -1.7779
quadrupole: 14.6975 -9.7539 -4.9435 -6.5893 -4.0360 -1.7779
hfenergy: -776.1384025 hartree
pointgroup: C01 [X(C11H15N5O1)]
dipole: -0.4498797 0.3631237 -0.5681339 debye
polarizability: 225.0496905|8.4277851|154.9449303|-7.6404686|10.1019988|96.828642 unknown
InChI: InChI=1S/C11H15N5O/c1-15(2)10-9-11(13-6-12-10)16(7-14-9)8-4-3-5-17-8/h6-8H,3-5H2,1-2H3
charge 0 multiplicity 1
32 atoms
O  -3.643388 0.788514 0.824163
N  -1.326289 0.233323 0.548936
N  0.382742 1.757604 0.589119
N  -0.053601 -1.812287 -0.057783
N  3.352907 0.764369 -0.100993
N  2.337828 -1.353342 -0.348272
C  -2.70252 -0.321018 0.752004
C  -3.156416 -1.184927 -0.439347
C  -3.6561 -0.114061 -1.442751
C  -4.287702 0.957481 -0.523961
C  -0.162986 -0.477452 0.223168
C  0.893559 0.484597 0.246221
C  -0.93465 1.560881 0.768649
C  2.212412 -0.004051 -0.065372
C  1.239716 -2.15669 -0.329257
C  3.364757 2.210448 0.178482
C  4.658231 0.165812 -0.427924
H  -2.728518 -0.843232 1.722937
H  -3.990533 -1.826487 -0.102463
H  -2.343823 -1.822451 -0.819141
H  -2.806116 0.304594 -2.008958
H  -4.383416 -0.523844 -2.162524
H  -4.102313 1.991951 -0.861134
H  -5.372116 0.806302 -0.37691
H  -1.655556 2.320811 1.054304
H  1.418461 -3.211239 -0.562085
H  2.350468 2.567217 0.410859
H  3.754508 2.760697 -0.700698
H  4.031049 2.42257 1.03806
H  5.36783 0.321688 0.407812
H  5.078208 0.639503 -1.336762
H  4.520165 -0.910383 -0.601979
